{"text_format":"1","workbook":"xlsx","n_sheets":10,"sheets":["Title III Budget","Transferability","Title III Program","IY","Private Schools","GEPA","General Assurances","Program Specific Assurances","Prefills","Sheet2"],"not_rendered":{"charts":0,"images":3,"macros":1,"external_links":4,"defined_names":253,"comments":2,"pivot_tables":0},"unopened":[],"bounds":{"document_bytes":16777216,"sheet_cells":100000,"rows_first":2000,"rows_last":500,"rows_between":2000,"halvings":0,"cell_chars":16384,"cell_head_chars":4096},"cells_cut":0,"cells_raw":0,"read":"whole","date_system":"1900"}

{"sheet":"Title III Budget","index":0,"n_rows":350,"n_cols":21,"rows_kept":350,"cut":false,"hidden":false,"merged":[[319,13,319,15],[319,11,319,12],[269,13,269,15],[303,8,303,10],[149,8,149,10],[303,13,303,15],[312,11,312,12],[315,13,315,15],[284,13,284,15],[291,8,291,10],[269,11,269,12],[314,13,314,15],[312,13,312,15],[313,8,313,10],[287,13,287,15],[318,13,318,15],[317,8,317,10],[297,0,297,15],[290,13,290,15],[318,11,318,12],[292,13,292,15],[307,11,307,12],[308,8,308,10],[308,11,308,12],[315,0,315,7],[273,13,273,15],[50,0,50,15],[51,0,51,15],[105,14,107,15],[105,0,108,0],[109,0,112,0],[314,11,314,12],[312,8,312,10],[313,11,313,12],[290,8,290,10],[291,11,291,12],[298,0,298,15],[301,13,301,15],[302,13,302,15],[301,0,301,7],[301,8,301,10],[293,11,293,12],[290,11,290,12],[291,13,291,15],[108,14,108,15],[112,14,112,15],[263,0,263,15],[264,0,264,7],[45,10,45,12],[98,0,98,15],[46,13,46,15],[46,4,46,12],[47,4,47,12],[292,8,292,10],[293,8,293,10],[308,13,308,15],[294,13,294,15],[293,13,293,15],[302,8,302,10],[306,11,306,12],[307,8,307,10],[304,11,304,12],[289,13,289,15],[158,11,158,12],[255,13,255,15],[265,13,265,15],[266,8,266,10],[264,11,264,12],[256,0,256,15],[264,8,264,10],[253,0,253,9],[255,10,255,12],[260,0,260,15],[266,0,266,7],[265,0,265,7],[266,13,266,15],[265,11,265,12],[319,0,319,7],[243,13,243,15],[320,13,320,15],[317,13,317,15],[290,0,290,7],[291,0,291,7],[244,13,244,15],[317,11,317,12],[315,8,315,10],[316,8,316,10],[315,11,315,12],[316,11,316,12],[314,8,314,10],[319,8,319,10],[293,0,293,7],[318,8,318,10],[313,0,313,7],[314,0,314,7],[285,8,285,10],[309,13,309,15],[307,13,307,15],[306,13,306,15],[251,0,251,9],[252,13,252,15],[158,13,158,15],[159,0,159,7],[300,0,300,15],[292,0,292,7],[299,0,299,15],[163,0,163,7],[163,8,163,10],[163,11,163,12],[164,0,164,7],[164,8,164,10],[164,11,164,12],[164,13,164,15],[165,0,165,7],[163,13,163,15],[220,0,220,15],[212,13,212,15],[210,10,210,12],[210,13,210,15],[211,0,211,9],[47,13,47,15],[48,4,48,12],[48,13,48,15],[278,13,278,15],[242,10,242,12],[246,13,246,15],[247,13,247,15],[253,13,253,15],[246,10,246,12],[254,10,254,12],[254,13,254,15],[250,13,250,15],[116,6,116,9],[270,13,270,15],[271,13,271,15],[232,10,232,12],[252,10,252,12],[86,7,87,15],[68,7,69,15],[261,0,261,15],[254,0,254,9],[262,0,262,15],[266,11,266,12],[162,13,162,15],[0,12,0,15],[35,7,35,14],[24,0,24,15],[28,0,28,15],[102,0,102,15],[83,7,84,15],[26,0,26,15],[64,0,64,15],[66,0,66,15],[43,4,43,12],[45,4,45,8],[44,4,44,8],[101,0,101,15],[57,13,57,15],[58,13,58,15],[20,14,20,15],[20,4,20,5],[23,0,23,15],[54,5,54,12],[17,7,17,15],[43,2,43,3],[31,0,31,5],[41,0,41,15],[43,0,43,1],[312,0,312,7],[274,0,274,7],[275,0,275,7],[282,13,282,15],[275,13,275,15],[276,0,276,7],[276,8,276,10],[276,11,276,12],[276,13,276,15],[277,0,277,7],[277,8,277,10],[277,11,277,12],[277,13,277,15],[278,11,278,12],[274,13,274,15],[311,0,311,7],[310,0,310,7],[281,11,281,12],[310,8,310,10],[310,11,310,12],[310,13,310,15],[285,13,285,15],[303,11,303,12],[286,13,286,15],[208,0,208,9],[208,10,208,12],[108,10,108,13],[104,10,104,13],[104,6,104,9],[105,1,105,5],[104,1,104,5],[119,10,119,13],[120,1,120,5],[116,0,118,0],[119,0,122,0],[106,6,106,9],[108,6,108,9],[114,10,114,13],[109,1,109,5],[118,1,118,5],[119,1,119,5],[108,1,108,5],[119,6,119,9],[122,6,122,9],[118,10,118,13],[117,6,117,9],[105,6,105,9],[105,10,105,13],[115,6,115,9],[113,0,115,0],[119,14,121,15],[124,10,124,13],[126,14,126,15],[124,6,124,9],[110,6,110,9],[113,1,113,5],[116,14,117,15],[117,10,117,13],[114,1,114,5],[120,6,120,9],[118,6,118,9],[115,10,115,13],[113,14,114,15],[54,0,54,3],[55,0,55,3],[56,5,56,9],[112,10,112,13],[112,6,112,9],[106,1,106,5],[109,6,109,9],[109,10,109,13],[54,13,54,15],[55,5,55,12],[55,13,55,15],[57,5,57,12],[57,0,57,3],[62,0,62,15],[58,5,58,12],[59,5,59,9],[89,7,90,15],[112,1,112,5],[110,1,110,5],[110,10,110,13],[111,1,111,5],[111,6,111,9],[111,10,111,13],[109,14,111,15],[129,1,129,5],[141,0,141,15],[137,0,137,15],[140,0,140,15],[125,10,125,13],[121,6,121,9],[121,10,121,13],[126,6,126,9],[122,14,122,15],[123,0,126,0],[127,1,127,5],[124,1,124,5],[128,6,128,9],[127,10,127,13],[126,10,126,13],[127,0,128,0],[123,6,123,9],[123,10,123,13],[125,6,125,9],[216,0,216,15],[219,0,219,15],[213,0,213,9],[1,13,1,14],[3,13,3,14],[7,13,7,14],[15,9,15,15],[5,14,5,15],[9,14,9,15],[19,13,19,15],[1,2,1,11],[2,2,2,11],[3,2,3,11],[4,2,4,11],[6,2,6,11],[7,2,7,11],[8,2,8,11],[9,2,9,11],[10,2,10,11],[16,9,16,11],[16,13,16,15],[18,7,18,15],[159,8,159,10],[159,11,159,12],[268,13,268,15],[311,8,311,10],[288,13,288,15],[268,11,268,12],[251,10,251,12],[251,13,251,15],[252,0,252,9],[149,13,149,15],[149,11,149,12],[250,0,250,9],[233,13,233,15],[159,13,159,15],[212,10,212,12],[160,0,160,7],[160,8,160,10],[160,11,160,12],[160,13,160,15],[161,0,161,7],[161,8,161,10],[161,11,161,12],[161,13,161,15],[162,0,162,7],[162,8,162,10],[162,11,162,12],[270,0,270,7],[275,8,275,10],[275,11,275,12],[273,0,273,7],[273,8,273,10],[273,11,273,12],[274,11,274,12],[303,0,303,7],[292,11,292,12],[289,11,289,12],[284,8,284,10],[278,0,278,7],[286,8,286,10],[269,0,269,7],[272,8,272,10],[288,11,288,12],[318,0,318,7],[317,0,317,7],[304,0,304,7],[309,0,309,7],[309,8,309,10],[295,0,295,15],[305,11,305,12],[305,13,305,15],[304,13,304,15],[305,0,305,7],[305,8,305,10],[301,11,301,12],[302,11,302,12],[306,0,306,7],[307,0,307,7],[308,0,308,7],[304,8,304,10],[302,0,302,7],[311,11,311,12],[309,11,309,12],[316,13,316,15],[313,13,313,15],[311,13,311,15],[306,8,306,10],[235,10,235,12],[238,0,238,15],[241,13,241,15],[240,0,240,15],[242,13,242,15],[248,0,248,9],[248,10,248,12],[248,13,248,15],[249,13,249,15],[241,10,241,12],[239,0,239,15],[245,13,245,15],[241,0,241,9],[249,0,249,9],[280,13,280,15],[282,0,282,7],[280,0,280,7],[280,8,280,10],[281,13,281,15],[280,11,280,12],[283,0,283,7],[316,0,316,7],[253,10,253,12],[245,10,245,12],[242,0,242,9],[265,8,265,10],[289,8,289,10],[285,11,285,12],[285,0,285,7],[287,0,287,7],[288,0,288,7],[289,0,289,7],[287,8,287,10],[288,8,288,10],[286,0,286,7],[286,11,286,12],[287,11,287,12],[249,10,249,12],[243,0,243,9],[244,0,244,9],[247,10,247,12],[245,0,245,9],[246,0,246,9],[244,10,244,12],[250,10,250,12],[229,10,229,12],[237,0,237,15],[231,13,231,15],[247,0,247,9],[231,0,231,9],[225,13,225,15],[230,0,230,9],[233,0,233,9],[234,0,234,9],[243,10,243,12],[230,13,230,15],[235,13,235,15],[229,0,229,9],[230,10,230,12],[232,0,232,9],[232,13,232,15],[231,10,231,12],[233,10,233,12],[234,13,234,15],[234,10,234,12],[227,0,227,9],[227,10,227,12],[227,13,227,15],[228,0,228,9],[223,0,223,9],[223,10,223,12],[223,13,223,15],[228,10,228,12],[228,13,228,15],[225,10,225,12],[225,0,225,9],[224,0,224,9],[222,10,222,12],[224,10,224,12],[222,13,222,15],[222,0,222,9],[189,10,189,12],[190,10,190,12],[197,0,197,15],[200,10,200,12],[198,0,198,15],[199,0,199,15],[192,0,192,9],[191,13,191,15],[189,13,189,15],[190,13,190,15],[191,10,191,12],[191,0,191,9],[189,0,189,9],[190,0,190,9],[192,13,192,15],[192,10,192,12],[196,0,196,15],[194,10,194,12],[150,0,150,7],[151,0,151,7],[150,11,150,12],[151,11,151,12],[150,13,150,15],[151,13,151,15],[150,8,150,10],[151,8,151,10],[148,8,148,10],[149,0,149,7],[148,13,148,15],[147,8,147,10],[147,13,147,15],[129,10,129,13],[138,0,138,15],[144,11,144,12],[145,11,145,12],[144,0,144,7],[122,10,122,13],[148,0,148,7],[146,0,146,7],[147,0,147,7],[145,0,145,7],[143,0,143,15],[130,1,130,5],[130,6,130,9],[130,10,130,13],[148,11,148,12],[147,11,147,12],[131,1,131,5],[130,14,130,15],[135,0,135,15],[144,8,144,10],[146,8,146,10],[133,1,133,15],[153,0,153,7],[153,8,153,10],[153,11,153,12],[153,13,153,15],[154,0,154,7],[154,8,154,10],[154,11,154,12],[154,13,154,15],[152,0,152,7],[152,8,152,10],[349,0,349,15],[348,1,348,15],[323,0,323,15],[330,0,330,15],[344,1,344,15],[329,0,329,15],[332,1,332,15],[334,1,334,15],[336,1,336,15],[325,0,325,15],[327,0,327,15],[345,1,345,15],[347,1,347,15],[340,0,340,15],[343,0,343,15],[346,0,346,15],[339,1,339,15],[341,1,341,15],[337,1,337,15],[342,1,342,15],[335,0,335,15],[158,8,158,10],[126,1,126,5],[123,1,123,5],[122,1,122,5],[121,1,121,5],[128,14,128,15],[128,10,128,13],[127,14,127,15],[155,11,155,12],[158,0,158,7],[128,1,128,5],[155,0,155,7],[155,8,155,10],[155,13,155,15],[156,0,156,7],[156,8,156,10],[156,11,156,12],[156,13,156,15],[157,0,157,7],[157,8,157,10],[157,11,157,12],[157,13,157,15],[152,11,152,12],[152,13,152,15],[146,13,146,15],[146,11,146,12],[116,1,116,5],[116,10,116,13],[113,10,113,13],[117,1,117,5],[118,14,118,15],[115,1,115,5],[114,6,114,9],[113,6,113,9],[144,13,144,15],[145,13,145,15],[127,6,127,9],[123,14,125,15],[145,8,145,10],[131,6,131,9],[131,10,131,13],[131,14,131,15],[129,14,129,15],[142,0,142,15],[125,1,125,5],[129,6,129,9],[115,14,115,15],[120,10,120,13],[42,2,42,3],[42,13,42,15],[42,4,42,12],[33,0,33,5],[42,0,42,1],[43,13,43,15],[42,16,42,19],[106,10,106,13],[107,1,107,5],[107,6,107,9],[107,10,107,13],[100,0,100,15],[43,16,43,21],[71,7,72,15],[74,7,75,15],[104,14,104,15],[80,7,81,15],[77,7,78,15],[92,7,93,15],[95,7,96,15],[44,10,44,12],[52,0,52,15],[58,0,58,3],[60,5,60,9],[11,2,11,11],[14,0,14,6],[14,9,14,15],[16,7,16,8],[16,0,16,6],[14,7,14,8],[15,7,15,8],[13,0,13,15],[37,0,37,15],[19,1,19,2],[25,0,25,15],[19,5,19,6],[15,0,15,6],[29,1,29,3],[39,0,39,15],[33,7,33,14],[35,0,35,5],[19,9,19,10],[20,0,20,3],[20,9,20,10],[17,0,18,6],[22,0,22,15],[31,7,31,14],[20,6,20,8],[20,11,20,13],[38,0,38,15],[180,0,180,9],[180,10,180,12],[165,8,165,10],[165,11,165,12],[165,13,165,15],[170,13,170,15],[171,13,171,15],[170,8,170,10],[171,8,171,10],[166,0,166,7],[166,8,166,10],[166,11,166,12],[166,13,166,15],[167,0,167,7],[167,8,167,10],[167,11,167,12],[167,13,167,15],[168,0,168,7],[168,8,168,10],[168,11,168,12],[168,13,168,15],[184,10,184,12],[184,13,184,15],[185,0,185,9],[185,10,185,12],[185,13,185,15],[186,0,186,9],[169,0,169,7],[169,8,169,10],[169,11,169,12],[169,13,169,15],[180,13,180,15],[176,0,176,15],[181,13,181,15],[172,11,172,12],[181,10,181,12],[172,8,172,10],[178,0,178,15],[177,0,177,15],[174,0,174,15],[170,0,170,7],[171,0,171,7],[170,11,170,12],[171,11,171,12],[172,13,172,15],[181,0,181,9],[179,0,179,15],[182,0,182,9],[182,10,182,12],[182,13,182,15],[202,0,202,9],[200,13,200,15],[201,13,201,15],[202,13,202,15],[193,0,193,9],[187,0,187,9],[193,13,193,15],[194,13,194,15],[193,10,193,12],[201,0,201,9],[183,0,183,9],[183,10,183,12],[183,13,183,15],[188,13,188,15],[187,10,187,12],[188,10,188,12],[184,0,184,9],[186,10,186,12],[186,13,186,15],[203,13,203,15],[203,0,203,9],[201,10,201,12],[202,10,202,12],[203,10,203,12],[200,0,200,9],[204,0,204,9],[204,13,204,15],[214,10,214,12],[213,13,213,15],[214,13,214,15],[213,10,213,12],[206,0,206,9],[212,0,212,9],[206,10,206,12],[205,10,205,12],[205,0,205,9],[205,13,205,15],[206,13,206,15],[208,13,208,15],[209,0,209,9],[211,10,211,12],[211,13,211,15],[207,13,207,15],[221,0,221,15],[218,0,218,15],[224,13,224,15],[229,13,229,15],[226,0,226,9],[226,10,226,12],[226,13,226,15],[320,8,320,12],[188,0,188,9],[271,0,271,7],[271,8,271,10],[271,11,271,12],[272,0,272,7],[284,11,284,12],[281,8,281,10],[282,8,282,10],[279,11,279,12],[279,8,279,10],[281,0,281,7],[272,11,272,12],[270,8,270,10],[270,11,270,12],[274,8,274,10],[284,0,284,7],[187,13,187,15],[204,10,204,12],[209,10,209,12],[207,0,207,9],[207,10,207,12],[209,13,209,15],[210,0,210,9],[294,8,294,12],[269,8,269,10],[268,0,268,7],[267,0,267,7],[278,8,278,10],[264,13,264,15],[272,13,272,15],[268,8,268,10],[267,13,267,15],[283,8,283,10],[283,13,283,15],[282,11,282,12],[283,11,283,12],[279,13,279,15],[279,0,279,7],[267,8,267,10],[267,11,267,12]]}
[null,null,null,null,null,null,null,null,null,null,null,null,"Place an \"X\" by the applicable response."]
[null,null,"Virginia Department of Education",null,null,null,null,null,null,null,null,null,"X"," Original "]
[null,null,"Office of ESEA Programs"]
[null,null,"P. O. Box 2120",null,null,null,null,null,null,null,null,null,null,"Revision:   "]
[null,null,"Richmond, Virginia 23218-2120",null,null,null,null,null,null,null,null,null,null,"Revision #"]
[null,null,null,null,null,null,null,null,null,null,null,null,null,"Date:"]
[null,null,"A.  COVER PAGE",null,null,null,null,null,null,null,null,null,null,"Explain"]
[null,null,"Title III, Part A, Language Instruction for English Learners and Immigrant Students ",null,null,null,null,null,null,null,null,null,null,"Amendment:"]
[null,null,"2020-2021 Individual Program Application ",null,null,null,null,null,null,null,null,null,null,"Amendment # "]
[null,null,"Due by July 1, 2020",null,null,null,null,null,null,null,null,null,null,"Date:       "]
[null,null,"Elementary and Secondary Education Act of 1965 (ESEA), as amended by",null,null,null,null,null,null,null,null,null,null,"Explain"]
[null,null,"the Every Student Succeeds Act of 2015 (ESSA), Public Law 114-95 "]
[]
["To be Completed by School Division"]
["Applicant  (Legal Name of Agency):",null,null,null,null,null,null,"Division Number:",null,"Title III Coordinator:"]
["ALBEMARLE COUNTY PUBLIC SCHOOLS",null,null,null,null,null,null,{"$f":"IF(ISBLANK(A16),\" \",VLOOKUP(A16,Prefills!A2:B148,2))","v":2},null,"Michele Castner"]
["Mailing Address (Street, City or Town, Zip Code):",null,null,null,null,null,null,"Phone:",null,"404-296-5820",null,null,"Ext:"]
["401 McIntire Road\nCharlottesville, VA  22902",null,null,null,null,null,null,"Email:"]
[null,null,null,null,null,null,null,"mcastner@k12albemarle.org"]
[]
["2020-2021 Title III, Part A Allocation",null,null,null,{"$f":"SUM(J21)+SUM(O21)","v":105852},null,"    EL Award Amount",null,null,105852,null,"   I/Y Award Amount:"]
[]
["Divisions that receive an Immigrant Children and Youth (IY) award must complete the “IY” tab after allocations are released."]
["LOCAL EDUCATIONAL AGENCY CERTIFICATION"]
["Use of Funds:  The applicant designated above applies for an allocation of federal assistance as appropriated under ESEA.  Funds are available to support local education reform efforts that are consistent with statewide education reform efforts to: 1) provide funding to implement promising education reform programs and school improvement programs based on evidence-based research;  2) provide a continuing source of innovative and educational improvement;  3) meet the educational needs of all students; and 4) develop and implement education programs to improve student achievement and teacher performance. \n\nSpecific uses of funds for this application are found in the \"Guidelines, Instructions, and Assurances\" document."]
[]
["Assurances:  The local educational agency assures that the Title III, Part A, program will be administered and implemented in compliance with all applicable statutes, regulations, policies, program plans, and applications.  Additionally, the local educational agency agrees by signing below to implement the general and program specific assurances located in the application.  The assurances and signed cover page are to be retained at the division level.  "]
[]
["Certification:  We hereby certify that, to the best of our knowledge, the information contained in this application is correct.  The agency named above has authorized us as its representatives to file this application, and such action is recorded in the minutes of the School Board meeting held "]
["on","2020-05-28",null,null,"."]
[]
[]
["Superintendent’s Signature",null,null,null,null,null,null,"Board Chairperson’s Signature"]
["Matthew S. Haas",null,null,null,null,null,null,"Jonno Alcaro"]
["Superintendent’s Name",null,null,null,null,null,null,"Board Chairperson’s Name"]
["2020-06-11",null,null,null,null,null,null,"2020-06-11"]
["Date",null,null,null,null,null,null,"Date"]
["Application Submission, Approval, and LEA Expenditure of Funds: Applications for Federal Funds are due by July 1, 2020.  Revisions and Amendments should be submitted in a timely manner.  Please note, in order for the funds to be expendable by July 1, 2020, the electronic application must be received at the Virginia Department of Education by July 1, 2020, through the file submission process of the Online Management of Education Grant Awards (OMEGA) system.  "]
[]
["Page 1"]
[null,null,null,null,"School Division:",null,{"$f":"$A$16","v":"ALBEMARLE COUNTY PUBLIC SCHOOLS"},null,null,null,null,null,"Division Number:",null,null,{"$f":"$H$16","v":2}]
["APPLICATION INFORMATION"]
["2019 - 2020 Allocation",null,"2019-2020\nConsolidated\nYes or No",null,"Program",null,null,null,null,null,null,null,null,"2020-2021\nAllocation Total",null,null,"Does allocation total match total in Cell E21?"]
[{"$f":"IF(ISBLANK($A$16),\" \",VLOOKUP($H$16,Prefills!$AT$3:$AW$142,4))","v":117426.86},null,null,null,"Title III, Part A, English Learners:  \n(Total  of: a + b; only a; or only b)",null,null,null,null,null,null,null,null,{"$f":"SUM(K45:M46)","v":105852},null,null,{"$f":"IF(SUM(N44)=SUM(E21),\"Yes\",\"No, check subtotals in this section\")","v":"Yes"}]
[null,null,null,null,"a.  EL Subgrant",null,null,null,null,"Subtotal ",105852,null,null,null,null,null,null,null,null,"Yes","No"]
[null,null,null,null,"b.  Immigrant Children and Youth  Subgrant",null,null,null,null,"Subtotal "]
[null,null,null,null,"Title II, Part A Transferability",null,null,null,null,null,null,null,null,{"$f":"N56","v":0}]
[null,null,null,null,"Title IV, Part A Transferability",null,null,null,null,null,null,null,null,{"$f":"N59","v":0}]
[null,null,null,null,"Total Allocation",null,null,null,null,null,null,null,null,{"$f":"SUM(N44+N47+N48)","v":105852}]
[]
["TRANSFERABILITY"]
["Section 5103(b)(2) of the Every Student Succeeds Act allows LEAs to transfer funds between certain qualifying federal programs. If funds are transferred into or out of the Title II, Part A, program, PRIOR APPROVAL IS REQUIRED, and a separate Transferability approval form must be submitted. The transfer request form is available at "]
["Transfer Request Form"]
[]
["Program from which funds will be transferred",null,null,null,null,"Select program(s) TO which funds will be transferred:",null,null,null,null,null,null,null,"Amount"]
["Title II, Part A",null,null,null,"TO","Title III, Part A, English Learners (EL Subgrant)"]
[]
["Program from which funds will be transferred",null,null,null,null,"Select program(s) TO which funds will be transferred:",null,null,null,null,null,null,null,"Amount"]
["Title IV, Part A",null,null,null,"TO","Title III, Part A, English Learners (EL Subgrant) "]
[]
[]
[]
["Page 2"]
[null,null,null,null,"School Division:",null,{"$f":"$A$16","v":"ALBEMARLE COUNTY PUBLIC SCHOOLS"},null,null,null,null,null,"Division Number:",null,null,{"$f":"$H$16","v":2}]
["REVISIONS AND AMENDMENTS"]
[]
["Place an \"X\" in the first box indicating whether it is a revision or amendment. Enter the date of the revision or amendment.  Indicate the tab(s) that have been changed. Provide a concise description of changes (for example, \"Programmatic Changes--purchase of additional reading materials, object code 6000; Budget Changes--decreased travel budget in object code 5000 and increased materials to purchase additional reading materials in object code 6000\"). When completing an amendment, changes to the program overview may be reflected as additions at the end of the narrative.\n\nNOTE: Any changes to the program budget should first be reflected in an amended application, followed by a budget transfer within 7 business days of approval of the amended application. Budget transfers will not be accepted without an approved amended application reflecting budget changes."]
[]
["1.","Revision",null,null,null,"Date:"]
[null,"Amendment",null,null,null,"Date:"]
[]
["2.","Revision",null,null,null,"Date:"]
[null,"Amendment",null,null,null,"Date:"]
[]
["3.","Revision",null,null,null,"Date:"]
[null,"Amendment",null,null,null,"Date:"]
[]
["4.","Revision",null,null,null,"Date:"]
[null,"Amendment",null,null,null,"Date:"]
[]
["5.","Revision",null,null,null,"Date:"]
[null,"Amendment",null,null,null,"Date:"]
[]
["6.","Revision",null,null,null,"Date:"]
[null,"Amendment",null,null,null,"Date:"]
[]
["7.","Revision",null,null,null,"Date:"]
[null,"Amendment",null,null,null,"Date:"]
[]
["8.","Revision",null,null,null,"Date:"]
[null,"Amendment",null,null,null,"Date:"]
[]
["9.","Revision",null,null,null,"Date:"]
[null,"Amendment",null,null,null,"Date:"]
[]
["10.","Revision",null,null,null,"Date:"]
[null,"Amendment",null,null,null,"Date:"]
[]
["Page 3"]
[null,null,null,null,"School Division:",null,{"$f":"$A$16","v":"ALBEMARLE COUNTY PUBLIC SCHOOLS"},null,null,null,null,null,"Division Number:",null,null,{"$f":"$H$16","v":2}]
["B.  BUDGET SUMMARY"]
["Title III, Part A"]
["Title III funds may be used to provide supplemental services that improve the English language proficiency and academic achievement of English Learners (ELs), including the provision of language instruction educational programs (LIEPs) and activities that increase the knowledge and skills of teachers who serve ELs. All services provided to ELs using Title III funds must supplement, and not supplant, the services that must be provided to ELs under Title VI of the Civil Rights Act of 1964 (Title VI), the Equal Educational Opportunities Act of 1974 (EEOA), and other federal requirements, as well as those under State or local laws."]
[]
["OBJECT CODE","EXPENDITURE",null,null,null,null,"EL SUBGRANT",null,null,null,"IMMIGRANT CHILDREN & YOUTH\n(IY) SUBGRANT",null,null,null,"DOES BUDGET SUMMARY MATCH DETAIL BUDGET?"]
["1000 -\n Personal Services","Administration"]
[null,"Non-Administrative",null,null,null,null,57507]
[null,"Private School Set-Aside"]
[null,"Total Personal Services",null,null,null,null,{"$f":"SUM(G106:J108)","v":57507},null,null,null,{"$f":"SUM(K106:N108)","v":0},null,null,null,{"$f":"IF(SUM(N173)=SUM(G109:N109),\"Yes\", \"No, please review your entries.\")","v":"Yes"}]
["2000 -\nEmployee Benefits","Administrative"]
[null,"Non-Administrative",null,null,null,null,23821]
[null,"Private School Set-Aside"]
[null,"Total Employee Benefits",null,null,null,null,{"$f":"SUM(G110:J112)","v":23821},null,null,null,{"$f":"SUM(K110:N112)","v":0},null,null,null,{"$f":"IF(SUM(N195)=SUM(G113:N113),\"Yes\",\"No-please review your entries.\")","v":"Yes"}]
["3000 - \nPurchased/\nContracted Services","Contracted Services",null,null,null,null,22500]
[null,"Private School Set-Aside"]
[null,"Total Purchased/Contracted Services",null,null,null,null,{"$f":"SUM(G114:J115)","v":22500},null,null,null,{"$f":"SUM(K114:N115)","v":0},null,null,null,{"$f":"IF(SUM(N215)=SUM(G116:N116),\"Yes\",\"No-please review your entries.\")","v":"Yes"}]
["4000 - \nInternal Services","Internal Services",null,null,null,null,500]
[null,"Private School Set-Aside"]
[null,"Total Internal Services",null,null,null,null,{"$f":"SUM(G117:J118)","v":500},null,null,null,{"$f":"SUM(K117:N118)","v":0},null,null,null,{"$f":"IF(SUM(N236)=SUM(G119:N119),\"Yes\",\"No-please review your entries.\")","v":"Yes"}]
["5000 - \nOther  \nCharges","Non-Administrative",null,null,null,null,837.29]
[null,"Indirect Cost"]
[null,"Private School Set-Asides"]
[null,"Total Other Charges",null,null,null,null,{"$f":"SUM(G120:J122)","v":837.29},null,null,null,{"$f":"SUM(K120:N122)","v":0},null,null,null,{"$f":"IF(SUM(N256)=SUM(G123:N123),\"Yes\",\"No-please review your entries.\")","v":"Yes"}]
["6000 - \nMaterials\n and Supplies","Administrative"]
[null,"Materials"]
[null,"Private School Set-Aside",null,null,null,null,686.71]
[null,"Total Materials and Supplies",null,null,null,null,{"$f":"SUM(G124:J126)","v":686.71},null,null,null,{"$f":"SUM(K124:N126)","v":0},null,null,null,{"$f":"IF(SUM(N295)=SUM(G127:N127),\"Yes\",\"No-please review your entries.\")","v":"Yes"}]
["8000 - \nCapital\nOutlay","Non-Administrative"]
[null,"Total Capital Outlay",null,null,null,null,{"$f":"SUM(G128:J128)","v":0},null,null,null,{"$f":"SUM(K128:N128)","v":0},null,null,null,{"$f":"IF(SUM(N321)=SUM(G129:N129),\"Yes\",\"No-please review your entries.\")","v":"Yes"}]
[null,"TOTAL SUBGRANT BUDGET",null,null,null,null,{"$f":"SUM(G129,G127,G123,G119,G116,G113,G109)","v":105852},null,null,null,{"$f":"SUM(K129,K127,K123,K119,K116,K113,K109)","v":0}]
[null,"TOTAL ALLOCATION",null,null,null,null,{"$f":"SUM(G130:N130)","v":105852},null,null,null,"Does the Total Allocation Equal Sum of Detailed Budget?",null,null,null,{"$f":"IF(SUM(G131)=SUM(N173+N195+N215+N236+N256+N295+N321),\"Yes\",\"No -please review your entries.\")","v":"Yes"}]
[null,"TOTAL PRIVATE SCHOOL SET-ASIDE",null,null,null,null,{"$f":"SUM(G108+G112+G115+G118+G122+G126)","v":686.71}]
[]
[null,"NOTES:  (1) Object codes 7000 and 9000 are not used in application budgets or in requests for reimbursements for this federal grant.\n              (2) Administrative costs are limited to 2 percent or less of the EL subgrant award including indirect costs.\n              (3) Indirect costs claims are subject to the availability of funds and statutory or administrative restrictions. Title III, Part A and \n                   Title IV, Part A, place a statutory limitation or cap on administrative costs. Because the cap applies to the combined claims for \n                    indirect costs and direct administrative costs, divisions may not be able to claim the entirety of their indirect costs. The \n                    amount unrecovered may not be shifted to another federal award.\n              (4) Expenses for parental involvement programs are to be incorporated into the appropriate object code(s) based on the category \n                   of the related charges."]
[]
["Page 5"]
[null,null,null,null,"School Division:",null,{"$f":"$A$16","v":"ALBEMARLE COUNTY PUBLIC SCHOOLS"},null,null,null,null,null,"Division Number:",null,null,{"$f":"$H$16","v":2}]
["C.  DETAILED BUDGET BREAKDOWN"]
["Include a detailed breakdown of the budget categories for Object Codes 1000-6000 and 8000, as shown on pages 4-5."]
[]
["DETAILED BUDGET DESCRIPTION OF OBJECT CODE 1000"]
["If applicable, indicate the positions and FTEs supported with funds from this program."]
["The ESOL Data Specialist runs a variety of diagnostic reports on English Learner (EL) data (academic achievement indicators by grade span or content area, graduation rates, Dually Identified ELs, Long-Term ELs, and Formerly ELs) in order to identify areas of improvement and/or professional development needs. The ESOL Data Specialist analyzes data to inform staffing, target parent engagement activities, and determine needs for new materials. The ESOL Family Engagement Liaison partners with school personnel to implement activities for increasing EL family engagement, by organizing EL-specific family events. ESOL family engagement activities are specific to each  school’s ESOL families interests and needs. "]
[" The ESOL Coach works with instructional coaches, as well as one-on-one with ESOL and content teachers to improve instruction that combines language and content objectives. Additionally, the coach supports teachers in adapting instruction to meet the language acquisition needs of students, while still maintaining high academic standards. Tutors and teachers provide supplementary support to ELs as needed after school and during the summer.  Substitutes will be provided so that ESOL teachers may attend PD opportunities.\nA new Family Literacy Project initiative is planned for a school site beginning in second semester. This will provide parents with English language instruction and their students with after school tutoring in reading and math. A teacher program director will be needed."]
["Item Description",null,null,null,null,null,null,null,"Funding Source",null,null,"FTEs",null,"Total Cost"]
["ESOL Data Specialist",null,null,null,null,null,null,null,"EL Subgrant",null,null,0.3,null,13098]
["ESOL Family Engagement Specialist",null,null,null,null,null,null,null,"EL Subgrant",null,null,0.5,null,20149]
["ESOL Coach",null,null,null,null,null,null,null,"EL Subgrant",null,null,0.3,null,17910]
["ESOL Tutors",null,null,null,null,null,null,null,"EL Subgrant",null,null,"NA",null,500]
["ESOL Substitutes",null,null,null,null,null,null,null,"EL Subgrant",null,null,"NA",null,850]
["Hourly Teacher Wages, after contract hours: Tutoring, Instruction, Family "]
["Engagement, in summer and after school",null,null,null,null,null,null,null,"EL Subgrant",null,null,"NA",null,3000]
["Hourly Teacher Wages: Director of After-School Family Literacy",null,null,null,null,null,null,null,"EL Subgrant",null,null,"NA"]
["Project at school site, to include teaching",null,null,null,null,null,null,null,"EL Subgrant",null,null,"NA",null,2000]
[]
[]
[]
[]
[]
[]
[]
[]
[]
[]
[]
[]
[]
[]
[]
[]
[]
[]
[null,null,null,null,"      ",null,null,null,"Total for Object Code:",null,null,{"$f":"SUM(L146:M172)","v":1.1000000000000001},null,{"$f":"SUM(N146:P172)","v":57507}]
[]
["Page 6"]
[null,null,null,null,"School Division:",null,{"$f":"$A$16","v":"ALBEMARLE COUNTY PUBLIC SCHOOLS"},null,null,null,null,null,"Division Number:",null,null,{"$f":"$H$16","v":2}]
["DETAILED BUDGET DESCRIPTION OF OBJECT CODE 2000"]
["Indicate the fixed charge categories (such as FICA, health, etc.) and specify the amount of each."]
["Fringe benefits--which consist of FICA, VSRS, Group Life, Health Insurance, and Dental Insurance--will be paid on the FTE positions, where applicable. FICA will be paid for tutors, subs, part-time staff, and after-hours teacher pay."]
[]
["Item Description",null,null,null,null,null,null,null,null,null,"Funding Source",null,null,"Total Cost"]
["FICA",null,null,null,null,null,null,null,null,null,"EL Subgrant",null,null,4399]
["Health Insurance",null,null,null,null,null,null,null,null,null,"EL Subgrant",null,null,9604]
["Dental Insurance",null,null,null,null,null,null,null,null,null,"EL Subgrant",null,null,311]
["VRS Retirement",null,null,null,null,null,null,null,null,null,"EL Subgrant",null,null,9121]
["Group Life Insurance",null,null,null,null,null,null,null,null,null,"EL Subgrant",null,null,386]
[]
[]
[]
[]
[]
[]
[]
[]
[null,null,null,null,"      ",null,null,null,null,null,"Total for Object Code:",null,null,{"$f":"SUM(N182:P194)","v":23821}]
[]
["DETAILED BUDGET DESCRIPTION OF OBJECT CODE 3000"]
["Provide a description of expenses related to purchased or contracted services.  If proposed expenditure is for professional development, justify such expenditures by demonstrating a relationship between proposed expenditure for professional development and the program services and activities described in the application. "]
["In addition to division-level training designed and tailored to the needs of teachers of EL students in areas such as Culturally Responsive Teaching, we plan for teachers to receive training in best instructional practices from the Center for Applied Linguistics and through conference attendance. Conferences may include those offered by VESA and VA TESOL, which will be in Richmond in the coming year. Family engagement training or conference attendance for our Family Engagement Specialist is planned, for regional programming."]
["We will retain the increased number of Imagine Learning digital licenses for supplemental instruction support for EL students, to provide interactive, targeted language acquisition exercises for more of our students. Teachers are able to easily track student progress through the Imagine Learning student accounts system.  \nWe will continue the practice of providing meals from local restaurants to enhance participation in specially-designed parent engagement events outside of the typical parent events offered by schools to target increased involvement by EL families. "]
["Item Description",null,null,null,null,null,null,null,null,null,"Funding Source",null,null,"Total Cost"]
["Professional Development",null,null,null,null,null,null,null,null,null,"EL Subgrant",null,null,2000]
["Imagine Learning Digital Learning Licenses",null,null,null,null,null,null,null,null,null,"EL Subgrant",null,null,20000]
["Meals for Parent Engagement Events, Activities",null,null,null,null,null,null,null,null,null,"EL Subgrant",null,null,500]
[]
[]
[]
[]
[]
[]
[]
[]
[]
[]
[null,null,null,null,"      ",null,null,null,null,null,"Total for Object Code:",null,null,{"$f":"SUM(N202:P214)","v":22500}]
[]
["Page 7"]
[null,null,null,null,"School Division:",null,{"$f":"$A$16","v":"ALBEMARLE COUNTY PUBLIC SCHOOLS"},null,null,null,null,null,"Division Number:",null,null,{"$f":"$H$16","v":2}]
["DETAILED BUDGET DESCRIPTION OF OBJECT CODE 4000"]
["Provide a description of charges from an Internal Service Fund to other functions/activities/elements of the local government for the use of intragovernmental services.  "]
["Some schools provide supplemental after-school and summer tutoring for Els.  We are able to increase student participation by providing bus transportation for Els in both tutoring and summer enrichment excursions. Additionally, we may provide transportation for EL families to attend ESOL-specific activities and parents conference and events."]
[]
["Item Description",null,null,null,null,null,null,null,null,null,"Funding Source",null,null,"Total Cost"]
["Bus transportation costs for school tutoring programs, transportation assistance for Parental ",null,null,null,null,null,null,null,null,null,"EL Subgrant",null,null,500]
["Engagement activities, and field trips during the summer."]
[]
[]
[]
[]
[]
[]
[]
[]
[]
[]
[null,null,null,null,"      ",null,null,null,null,null,"Total for Object Code:",null,null,{"$f":"SUM(N224:P235)","v":500}]
[]
["DETAILED BUDGET DESCRIPTION OF OBJECT CODE 5000"]
["Provide a description for expenses related to object code 5000.  Include expenditures that support the use of programs. Includes expenditures that support the program, staff/administrative/consultant travel, office phone charges, training, leases/rental, indirect cost, and other."]
["The professional development activities described in OC 3000 will require reimbursement of travel costs for participants to attend these courses, conferences, and training programs.  In addition, attendance at professional association meetings such as VESA Board Meetings will support keeping abreast of current program requirements, collaborating with other ESOL professionals, and enhancing program services such as Family Engagement. We will pay expenses associated with travel to these meetings. "]
[]
["Item Description",null,null,null,null,null,null,null,null,null,"Funding Source",null,null,"Total Cost"]
["Expenses for Travel to Conferences, Training and Professional Meetings",null,null,null,null,null,null,null,null,null,"EL Subgrant",null,null,837.29]
[]
[]
[]
[]
[]
[]
[]
[]
[]
[]
[]
[]
[null,null,null,null,"      ",null,null,null,null,null,"Total for Object Code:",null,null,{"$f":"SUM(N243:P255)","v":837.29}]
["Page 8"]
[null,null,null,null,"School Division:",null,{"$f":"$A$16","v":"ALBEMARLE COUNTY PUBLIC SCHOOLS"},null,null,null,null,null,"Division Number:",null,null,{"$f":"$H$16","v":2}]
[]
[]
["DETAILED BUDGET DESCRIPTION OF OBJECT CODE 6000"]
["Provide a description of materials, supplies, and all equipment less $5,000 per unit.  Indicate the estimated quantity of each item."]
["Continuing consultation and support for participating private schools involves professional development programming, which may necessitate the purchase of materials on their behalf.  Instructional materials may also be needed for private school teachers."]
[]
["Item Description",null,null,null,null,null,null,null,"Funding Source",null,null,"Quantities",null,"Total Cost"]
["Private School Materials, to support instruction of EL students and ",null,null,null,null,null,null,null,"EL Subgrant",null,null,null,null,686.71]
["teacher professional development"]
[]
[]
[]
[]
[]
[]
[]
[]
[]
[]
[]
[]
[]
[]
[]
[]
[]
[]
[]
[]
[]
[]
[]
[]
[]
[]
[]
[null,null,null,null,"      ",null,null,null,"Total for Object Code:",null,null,null,null,{"$f":"SUM(N266:P294)","v":686.71}]
["Page 9"]
[null,null,null,null,"School Division:",null,{"$f":"$A$16","v":"ALBEMARLE COUNTY PUBLIC SCHOOLS"},null,null,null,null,null,"Division Number:",null,null,{"$f":"$H$16","v":2}]
["DETAILED BUDGET DESCRIPTION OF OBJECT CODE 8000"]
["Provide a description for expenses related to object code 8000 not included in the justification above.  All capital outlay expenditures over $5,000 per unit must be approved in advance by the Department of Education. If the school division has established a threshold of a lesser amount, items equal to that amount or greater must also receive prior approval by the Department of Education.  Equipment quantities must be specified."]
[]
[]
["Item Description",null,null,null,null,null,null,null,"Funding Source",null,null,"Quantities",null,"Total Cost"]
[]
[]
[]
[]
[]
[]
[]
[]
[]
[]
[]
[]
[]
[]
[]
[]
[]
[]
[null,null,null,null,"      ",null,null,null,"Total for Object Code:",null,null,null,null,{"$f":"SUM(N303:P320)","v":0}]
[]
[]
["Page 10"]
[null,null,null,null,"School Division:",null,{"$f":"$A$16","v":"ALBEMARLE COUNTY PUBLIC SCHOOLS"},null,null,null,null,null,"Division Number:",null,null,{"$f":"$H$16","v":2}]
["EXPENDITURE ACCOUNTS DESCRIPTIONS"]
[]
["These accounts are for budgeting and recording expenditures of the educational agency for activities under its control.  Below are definitions of the major expenditure categories.  The descriptions provided are examples only.   For further clarification on the proper expenditures of funds, contact your school division budget or finance office, the grant specialist in the Virginia Department of Education, or refer to the appropriate federal act."]
[]
["OBJECT CODE DEFINITIONS:"]
["(revised 5/16/17)"]
[]
[1000,"PERSONAL SERVICES - Includes all compensation for the direct labor of persons in the employment of the local government.  Salaries and wages paid to employees for full‐ and part‐time work, including overtime, shift differential, and similar compensation. Includes payments for time not worked, including sick leave, vacation, holidays, jury duty, military leave, and other paid absences that are earned during the reporting period.  \n\nFor the purposes of this report, the term “salaries” means all compensation including base wage.  This also includes amounts paid through salary reduction plans, such as tax‐sheltered annuities and flexible benefit plans.  Do not confuse this definition with the Virginia Retirement System (VRS) definition, which excludes supplements for retirement calculation purposes in some circumstances.\n"]
[]
[2000,"EMPLOYEE BENEFITS - Job related benefits provided to employees as part of their total compensation.  Fringe benefits include the employer’s portion of FICA, pensions, insurance (life, health, disability income, etc.) and employee allowances.  \n\nNOTE:  Fringe Benefits are a significant component of employee compensation and, like salaries and wages, are charged to the appropriate object of expenditure within each program.  If possible, fringe benefit costs should be charged to the applicable educational program or activity on an ongoing basis.  An alternative is to charge all fringe benefits to various benefit accounts.  As part of the year‐end closing process, these accounts are closed, and all costs are allocated to the appropriate educational program or activity.  The following methods are suggested for allocating such cost at year‐end.  If these methods do not provide reasonable allocations based on circumstances within the school division, then the school division should use another reasonable allocation method.  Consistency in application should be maintained at all times.\n\n• Allocation by percentage of payroll dollars\n• Allocation by Head Count\n• Direct to Program or Activity\n"]
["Page 11"]
[3000,"PURCHASED/CONTRACTUAL SERVICES - Services acquired from outside sources (i.e., private vendors, public authorities, or other governmental entities).  Purchase of the service is on a fee basis or fixed time contract basis.  Payments for rentals and utilities are not included in this account description.  Allowable payments would be to individual or firms that are independent contractors and not employees of the grantee or sub‐grantee organization.  The word honorarium is sometimes used to characterize such payments; the term “fee” is preferred.\n\n• Food Purchases – Prepared meals, working meals, and/or catered services purchased through a vendor are included in this object code.  Reimbursement is capped at the per diem rate for the meal listed according to the state travel regulations.  Examples for this object code include meals provided during day‐long professional development sessions, or meals provided to support attendance at family engagement activities.  Food purchased from catering services and restaurants such as Pizza Hut, Panera Bread, and Subway is included in this object code.\n\n• Transportation Services Public Carriers – Payments to public carriers for transportation of pupils on vehicles that are used by the public. Include payments for pupils transported in intra‐city transit buses, taxicabs, airplanes, and intercity/interstate passenger buses.\n\n• Transportation Services Private Carriers – Payments (either cash or tokens) to parents for transportation of pupils in lieu of providing transportation on school buses. Include allowable payments to parents for pupils attending public, private, and non‐sectarian schools. Include costs associated with transporting special education students in school board‐owned vehicles to and from school.\n\n• Transportation Services by Contract – Payments to private owners of school buses who contract with the school board to transport pupils to and from public schools. Include payments to owners of private vehicles that contract with the school board to transport pupils to and from designated public and private schools.\n\n"]
[null,"• Purchase of Service from Other Governmental Entities – Payments for services purchased from other governmental entities (i.e., other local governments, public authorities, state agencies, and other LEAs) on a contract/fee basis. Tuition payments to other local governments for a jointly operated center are not included here but are reported under “Payments to Joint Operations” (object code 7000).\n\n• Tuition Paid – Other Divisions In‐State, Tuition Paid – Other Divisions Out‐of‐State, and Tuition Paid – Private Schools are included in this object code.\n"]
[]
[4000,"INTERNAL SERVICES - Charges from an Internal Service Fund to other functions/activities/elements of the local government for the use of intergovernmental services, such as data processing, automotive/motor pool, central purchasing/central stores, print shop, and risk management. These services are provided by internal services within the School District and possibly the county but not a vendor.  \n\n• Food Purchases – Food purchased from the food services department of a school division or subgrantee equivalent to support professional development or family engagement events is included in this object code.  For example, internal expenses for school cafeterias to provide meals to support attendance at family engagement activities are included in this object code.\n"]
["Page 12"]
[5000,"OTHER CHARGES - Include expenditures that support the use of programs. Includes expenditures that support the program, including utilities (maintenance and operation of plant), staff/administrative/consultant travel, office phone charges, training, leases/rental, indirect cost, and other.\n\n• Food Purchases – Food Purchases under this object code are restricted to food purchases related to travel reimbursement for meals only (see Travel below). If the sub‐recipient’s internal travel policies conform to state travel regulations, reimbursement is allowable at per diem meals rates according to state travel regulations. If the sub‐recipient’s internal travel policies require reimbursement for the cost of each meal, reimbursement is capped at the per diem rate for the meal listed according to the state travel regulations. Sub‐recipients must elect either meals per diem or per meals costs as their internal travel policy.\n\n• Telecommunications – Include expenditures for recurring telecommunications services for the use of on‐line computer technology (e.g., telephone/telecommunications line charges).  Telephone charges for line service for Internet connectivity and the Electronic Classroom program.\n\n• Utilities – Payments for heat, electricity, water, and sewer services regardless of whether the service is provided by a private enterprise authority or an enterprise fund operated by a local government.\n\n• Communications – Payments for postal, messenger, and telecommunications services, typically office voice telephone charges.  (Telecommunication costs directly related to technology uses should be coded under 6000.) In addition, office telephone charges would be coded under this code.\n\n• Insurance – Payments for insurance except those that relate to personal services (i.e., hospitalization, group life, worker’s compensation, unemployment)\n\n• Leases and Rentals – Includes payments for leases that are not capitalized and rental of land, structures, and equipment. Do not include payments made under a lease‐purchase agreement.\n\n"]
[null,"• Travel – includes payments for travel reimbursement for staff/administrative/consultant travel. These are travel costs that are being reimbursed directly to travelers.  These costs may include lodging, mileage, meals, and incidentals as allowable according to state travel regulations or documented subrecipient internal travel policies. If the sub‐recipient does not have documented internal travel policies, state travel regulations will prevail.\n\n• Contributions to Other Entities – Includes payments to other governmental entities or community organizations that are not related to the direct purchase of a service on a fee basis (which is reported under object code 3000) or payments to joint operations (which are reflected under object code 7000).\n\n• Public Assistance Payments – Payments to individuals for public assistance programs (general government use only).\n\n• Miscellaneous Other Charges – Includes expenditures that support the program, including indirect costs and other costs.\n"]
["Page 13"]
[6000,"MATERIALS AND SUPPLIES - Includes articles and commodities that are consumed or materially altered when used and minor equipment that is not capitalized.  This includes any equipment purchased under $5,000, unless the LEA has set a lower capitalization threshold.  Therefore, computer equipment under $5,000 would be reported in “materials and supplies.”\n\n• Food Purchases – Food items purchased from a grocery store or its equivalent for snacks or breaks is included in this object code.  Examples include bottled water, granola bars, cookies, and fruit purchased from a store such as Wal‐Mart, Food Lion, Costco, etc.  Prepared meals is not included in this object code; see object code 3000 for prepared/working/catered meals as purchased/contracted services.\n\n• Vehicle and Powered Equipment Fuels – Gasoline, lubricating oils, or such other fuel used in the operation of vehicles and powered equipment (e.g., lawnmowers) purchased from private sources or governmental agencies.\n\n• Vehicle and Powered Equipment Supplies – Tires, spark plugs, batteries, and chains used in the operation of vehicles and powered equipment purchased from private sources or governmental agencies.\n\n• Textbooks – All textbooks and workbooks purchased to be used in the classroom.\n\n• Instructional Materials – Books (not textbooks) and other materials.\n\n"]
[null,"• Technology Software/On‐line Content – Include expenditures for videodiscs and computer programs used in the classroom for instructional purposes, operating system software (i.e., standalone software, not software that is pre‐installed and included in hardware costs), application software, and on‐line or downloadable software and content. Include expenditures for both additions and replacement.\n\n• Non‐Capitalized Technology Hardware – Include expenditures for hardware or classroom technology equipment that is not capitalized.\n\n• Non‐Capitalized Technology Infrastructure – Include expenditures for technology infrastructure that is not capitalized.\n"]
["Page 14"]
[8000,"CAPITAL OUTLAY - Note: Indirect cost cannot be claimed against capital outlay and equipment.\nOutlays that result in the acquisition of or additions to fixed assets.  Capital Outlay includes the purchase\nof fixed assets both replacement and/or additional.\n\nCapital Outlay Replacement\n\n• Technology – Hardware Replacements – Include capital outlay for replacement of hardware or classroom technology equipment. (For further clarification on which expenditures should be included in this object code, see the “Special Note” below.)\n\n• Technology – Infrastructure Replacements – Include capital outlay for replacement of technology infrastructure. (For further clarification on which expenditures should be included in this object code, see the “Special Note” below.)\n\n• Capital Outlay Additions – Include machinery, equipment, furniture, fixtures, communications equipment, motor vehicles, etc. that are capitalized.\n\n• Technology – Hardware Additions – Include capital outlay for additional hardware or classroom technology equipment. (For further clarification on which expenditures should be included in this object code, see the “Special Note” below.)  \n\n• Technology – Infrastructure Additions – Include capital outlay for additional technology infrastructure. (For further clarification on which expenditures should be included in this object code, see the “Special Note” below.)\n\n"]
[null,"• Special Note ‐ Classification of Hardware and Infrastructure Expenditures: \n\nReport expenditures under technology “hardware” for computers, associated peripheral equipment, and other specialized technology equipment. Computers include desktop and laptop machines, handheld computers (i.e., Personal Digital Assistants or PDAs), and mainframe machines. Peripheral equipment includes devices attached to computers, such as monitors, keyboards, disk drives, modems, printers, scanners, cameras and speakers, etc.\n\nReport other specialized computer devices under technology “hardware” such as fax‐back and voicemail resources; videoconferencing and other distance education tools, including satellite transmitters and receivers; cable‐based receivers; and modem or codec‐based video equipment; projection devices, from transparent and opaque projectors to video monitors; and graphing calculators and other specialized computational aids.\n\nReport expenditures under technology “infrastructure” for equipment and devices that enable the linking of computers or video hardware to networks (such as routers, hubs, switches, access servers, modems, or codecs). Infrastructure also refers to cabling installations, whether wire, fiber optic, or coaxial, as well as electrical capacity expansion or HVAC upgrades to support networks. In wireless networking systems, include receivers and transmitters under infrastructure."]
["Page 15"]

{"sheet":"Transferability","index":1,"n_rows":179,"n_cols":15,"rows_kept":179,"cut":false,"hidden":false,"merged":[[178,0,178,12],[158,0,158,12],[117,0,117,12],[84,0,84,12],[71,0,71,12],[174,10,174,11],[173,0,173,7],[173,8,173,9],[175,10,175,11],[121,0,121,12],[122,0,122,12],[173,10,173,11],[174,0,174,7],[174,8,174,9],[127,0,127,9],[127,10,127,11],[128,10,128,11],[162,0,162,12],[163,0,163,12],[137,0,137,12],[138,0,138,12],[129,10,129,11],[128,0,128,9],[172,0,172,7],[172,8,172,9],[172,10,172,11],[169,0,169,7],[169,8,169,9],[169,10,169,11],[170,0,170,7],[171,0,171,7],[171,8,171,9],[171,10,171,11],[170,8,170,9],[170,10,170,11],[167,0,167,7],[167,8,167,9],[167,10,167,11],[168,0,168,7],[168,8,168,9],[168,10,168,11],[165,0,165,7],[165,8,165,9],[165,10,165,11],[166,0,166,7],[166,8,166,9],[166,10,166,11],[153,0,153,7],[153,8,153,9],[153,10,153,11],[154,0,154,7],[154,8,154,9],[154,10,154,11],[160,0,160,12],[161,0,161,12],[164,0,164,7],[155,0,155,7],[155,8,155,9],[155,10,155,11],[156,10,156,11],[164,8,164,9],[164,10,164,11],[150,0,150,7],[150,8,150,9],[150,10,150,11],[151,0,151,7],[151,8,151,9],[151,10,151,11],[152,0,152,7],[152,8,152,9],[152,10,152,11],[147,0,147,7],[147,8,147,9],[147,10,147,11],[148,0,148,7],[148,8,148,9],[148,10,148,11],[149,0,149,7],[149,8,149,9],[149,10,149,11],[144,0,144,7],[144,8,144,9],[144,10,144,11],[145,0,145,7],[145,8,145,9],[145,10,145,11],[146,0,146,7],[146,8,146,9],[146,10,146,11],[141,0,141,7],[141,8,141,9],[141,10,141,11],[142,0,142,7],[142,8,142,9],[142,10,142,11],[143,0,143,7],[143,8,143,9],[143,10,143,11],[125,0,125,9],[125,10,125,11],[126,0,126,9],[126,10,126,11],[140,0,140,7],[140,8,140,9],[140,10,140,11],[131,0,131,9],[131,10,131,11],[135,0,135,12],[136,0,136,12],[129,0,129,9],[139,0,139,7],[139,8,139,9],[139,10,139,11],[132,10,132,11],[130,0,130,9],[130,10,130,11],[112,0,112,9],[112,10,112,11],[113,0,113,9],[113,10,113,11],[120,0,120,12],[124,0,124,9],[124,10,124,11],[119,0,119,12],[123,0,123,9],[123,10,123,11],[114,10,114,11],[108,0,108,9],[108,10,108,11],[109,0,109,9],[109,10,109,11],[110,0,110,9],[110,10,110,11],[111,0,111,9],[111,10,111,11],[103,0,103,12],[107,0,107,9],[107,10,107,11],[105,0,105,12],[106,0,106,12],[104,0,104,12],[97,0,97,9],[97,10,97,11],[100,0,100,9],[100,10,100,11],[98,0,98,9],[98,10,98,11],[99,0,99,9],[99,10,99,11],[101,10,101,11],[93,0,93,9],[93,10,93,11],[90,0,90,12],[91,0,91,12],[94,0,94,9],[94,10,94,11],[95,0,95,9],[95,10,95,11],[96,0,96,9],[96,10,96,11],[81,0,81,9],[81,10,81,11],[82,0,82,9],[82,10,82,11],[83,10,83,11],[88,0,88,12],[89,0,89,12],[92,0,92,9],[92,10,92,11],[76,0,76,9],[76,10,76,11],[77,0,77,9],[77,10,77,11],[78,0,78,9],[78,10,78,11],[79,0,79,9],[79,10,79,11],[80,0,80,9],[80,10,80,11],[66,0,66,7],[66,8,66,9],[66,10,66,11],[67,10,67,11],[67,8,67,9],[70,0,70,12],[74,0,74,9],[74,10,74,11],[75,0,75,9],[75,10,75,11],[72,0,72,12],[73,0,73,12],[63,0,63,7],[63,8,63,9],[63,10,63,11],[64,0,64,7],[64,8,64,9],[64,10,64,11],[65,0,65,7],[65,8,65,9],[65,10,65,11],[60,0,60,7],[60,8,60,9],[60,10,60,11],[61,0,61,7],[61,8,61,9],[61,10,61,11],[62,0,62,7],[62,8,62,9],[62,10,62,11],[58,0,58,7],[58,8,58,9],[58,10,58,11],[49,0,49,14],[47,0,47,2],[46,0,46,2],[55,0,55,12],[56,0,56,12],[59,0,59,7],[59,8,59,9],[59,10,59,11],[54,0,54,12],[35,0,35,2],[37,0,37,2],[39,0,39,2],[40,0,40,2],[51,0,51,12],[53,0,53,12],[57,8,57,9],[57,10,57,11],[44,0,44,2],[45,0,45,2],[43,0,43,2],[41,0,41,2],[42,0,42,2],[38,0,38,2],[36,0,36,2],[30,0,30,2],[31,0,31,2],[33,0,33,2],[32,0,32,2],[34,0,34,2],[27,0,27,2],[29,0,29,2],[28,0,28,2],[26,0,26,2],[23,0,23,2],[17,0,17,2],[18,0,18,2],[20,0,20,2],[19,0,19,2],[21,0,21,2],[22,0,22,2],[24,0,24,2],[25,0,25,2],[12,0,12,2],[15,0,15,2],[16,0,16,2],[14,0,14,2],[13,0,13,2],[1,0,1,14],[8,3,8,14],[9,3,10,4],[9,5,10,6],[9,7,10,8],[9,9,10,9],[9,13,10,14],[3,0,3,14],[9,12,10,12],[9,10,10,11],[5,0,5,12],[6,0,6,16383]]}
[null,null,null,null,"School Division:",null,{"$f":"'Title III Budget'!$A$16","v":"ALBEMARLE COUNTY PUBLIC SCHOOLS"},null,null,null,null,null,"Division Number:",null,{"$f":"'Title III Budget'!$H$16","v":2}]
["D.  TRANSFERABILITY"]
[]
["Section 5103(b)(2) of ESSA allows divisions to transfer all or a portion of the funds received from Title II, Part A, or Title IV, Part A, into: Title I, Part A; Title I, Part C; Title I, Part D; Title II, Part A; Title III, Part A; Title IV, Part A; or Title V, Part B.  "]
[]
["Complete the tab below if funds will be transferred under Section 5103(b)(2). Please note that prior approval is required to transfer funds. The transfer request form is provided at "]
["Transfer Request Form"]
[]
[null,null,null,"Amount Budgeted"]
[null,null,null,"Title I, Part A",null,"Title I, Part C",null,"Title I, Part D",null,"Title II, Part A","Title III, Part A",null,"Title IV, Part A","Title V, Part B"]
[]
[null,null,null,"Title II, Part A, Transferability","Title IV, Part A, Transferability","Title II, Part A, Transferability","Title IV, Part A, Transferability","Title II, Part A, Transferability","Title IV, Part A, Transferability","Title IV, Part A, Transferability","Title II, Part A, Transferability\nAward S367A200044\nProject Code APE60016\n","Title IV, Part A, Transferability\nAward S424A200048\nProject Code APE60023\n","Title II, Part A, Transferability","Title II, Part A, Transferability","Title IV, Part A, Transferability"]
["Amount Transferred to Program",null,null,null,null,null,null,null,null,null,{"$f":"'Title III Budget'!N56","v":0},{"$f":"'Title III Budget'!N59","v":0}]
["OBJECT CODE - EXPENDITURE TYPE"]
["1000 -  Personal Services"]
["Administration",null,null,null,null,null,null,null,null,null,0,0]
["Non-Administrative",null,null,null,null,null,null,null,null,null,0,0]
["Private School Set-Aside ",null,null,null,null,null,null,null,null,null,0,0]
["Total Personal Services",null,null,null,null,null,null,null,null,null,{"$f":"SUM(K16:K18)","v":0},{"$f":"SUM(L16:L18)","v":0}]
["2000 - Employee Benefits"]
["Administrative",null,null,null,null,null,null,null,null,null,0,0]
["Non-Administrative",null,null,null,null,null,null,null,null,null,0,0]
["Private School Set-Aside ",null,null,null,null,null,null,null,null,null,0,0]
["Total Employee Benefits",null,null,null,null,null,null,null,null,null,{"$f":"SUM(K21:K23)","v":0},{"$f":"SUM(L21:L23)","v":0}]
["3000 - Purchased/Contracted Services"]
["Contracted Services",null,null,null,null,null,null,null,null,null,0,0]
["Private School Set-Aside ",null,null,null,null,null,null,null,null,null,0,0]
["Total Purchased/Contracted Services",null,null,null,null,null,null,null,null,null,{"$f":"SUM(K26:K27)","v":0},{"$f":"SUM(L26:L27)","v":0}]
["4000 - Internal Services"]
["Internal Services",null,null,null,null,null,null,null,null,null,0,0]
["Private School Set-Aside ",null,null,null,null,null,null,null,null,null,0,0]
["Total Internal Services",null,null,null,null,null,null,null,null,null,{"$f":"SUM(K30:K31)","v":0},{"$f":"SUM(L30:L31)","v":0}]
["5000 - Other Charges"]
["Non-Administrative",null,null,null,null,null,null,null,null,null,0,0]
["Indirect Cost",null,null,null,null,null,null,null,null,null,0,0]
["Private School Set-Aside ",null,null,null,null,null,null,null,null,null,0,0]
["Total Other Charges",null,null,null,null,null,null,null,null,null,{"$f":"SUM(K34:K36)","v":0},{"$f":"SUM(L34:L36)","v":0}]
["6000 - Materials and Supplies"]
["Administrative",null,null,null,null,null,null,null,null,null,0,0]
["Non-Administrative",null,null,null,null,null,null,null,null,null,0,0]
["Private School Set-Aside ",null,null,null,null,null,null,null,null,null,0,0]
["Total Materials and Supplies",null,null,null,null,null,null,null,null,null,{"$f":"SUM(K39:K41)","v":0},{"$f":"SUM(L39:L41)","v":0}]
["8000 - Capital Outlay"]
["Non-Administrative",null,null,null,null,null,null,null,null,null,0,0]
["Total Capital Outlay",null,null,null,null,null,null,null,null,null,{"$f":"SUM(K44:K44)","v":0},{"$f":"SUM(L44:L44)","v":0}]
["Total Budget",null,null,null,null,null,null,null,null,null,{"$f":"SUM(K19,K24,K28,K32,K37,K42,K45)","v":0},{"$f":"SUM(L19,L24,L28,L32,L37,L42,L45)","v":0}]
["Total Private School Set-Aside",null,null,null,null,null,null,null,null,null,{"$f":"SUM(K18+K23+K27+K31+K36+K41)","v":0},{"$f":"SUM(L18+L23+L27+L31+L36+L41)","v":0}]
["Does the Total Budget Match the Amount Transferred into Program?",null,null,null,null,null,null,null,null,null,{"$f":"IF(K46=K13,\"Yes\",\"No\")","v":"Yes"},{"$f":"IF(L46=L13,\"Yes\",\"No\")","v":"Yes"}]
[]
["Page 16"]
[null,null,null,null,"School Division:",null,{"$f":"'Title III Budget'!A16","v":"ALBEMARLE COUNTY PUBLIC SCHOOLS"},null,null,null,null,"Division Number:",{"$f":"'Title III Budget'!H16","v":2}]
["DETAILED BUDGET BREAKDOWN"]
["Include a detailed breakdown of the budget categories for Object Codes 1000-6000 and 8000, as shown on page 16.",null,null,null,null,null,null,null,null,{"$f":"IF(SUM(K13:L13)=SUM(M68+M84+M102+M115+M133+M157+M176),\"Yes\",\"No -please review your entries.\")","v":"Yes"}]
["DETAILED BUDGET DESCRIPTION OF OBJECT CODE 1000"]
["If applicable, indicate the positions and FTEs supported with funds from this program."]
[]
[]
["Item Description",null,null,null,null,null,null,null,"Funding Source",null,"FTEs",null,"Total Cost"]
[]
[]
[]
[]
[]
[]
[]
[]
[]
[null,null,null,null,"      ",null,null,null,"Total for Object Code:",null,{"$f":"SUM(K59:L67)","v":0},null,{"$f":"SUM(M59:M67)","v":0}]
[]
[]
["DETAILED BUDGET DESCRIPTION OF OBJECT CODE 2000"]
["Indicate the fixed charge categories (such as FICA, health, etc.) and specify the amount of each."]
[]
[]
["Item Description",null,null,null,null,null,null,null,null,null,"Funding Source",null,"Total Cost"]
[]
[]
[]
[]
[]
[]
[]
[]
[null,null,null,null,"      ",null,null,null,null,null,"Total for Object Code:",null,{"$f":"SUM(M76:M83)","v":0}]
["Page 17"]
[null,null,null,null,"School Division:",null,{"$f":"'Title III Budget'!A16","v":"ALBEMARLE COUNTY PUBLIC SCHOOLS"},null,null,null,null,"Division Number:",{"$f":"'Title III Budget'!H16","v":2}]
[]
[]
["DETAILED BUDGET DESCRIPTION OF OBJECT CODE 3000"]
["Provide a description of expenses related to purchased or contracted services.  If proposed expenditure is for professional development, justify such expenditures by demonstrating a relationship between proposed expenditure for professional development and the program services and activities described in the application. "]
[]
[]
["Item Description",null,null,null,null,null,null,null,null,null,"Funding Source",null,"Total Cost"]
[]
[]
[]
[]
[]
[]
[]
[]
[null,null,null,null,"      ",null,null,null,null,null,"Total for Object Code:",null,{"$f":"SUM(M94:M101)","v":0}]
[]
["DETAILED BUDGET DESCRIPTION OF OBJECT CODE 4000"]
["Provide a description of charges from an Internal Service Fund to other functions/activities/elements of the local government for the use of intragovernmental services.  "]
[]
[]
["Item Description",null,null,null,null,null,null,null,null,null,"Funding Source",null,"Total Cost"]
[]
[]
[]
[]
[]
[]
[null,null,null,null,"      ",null,null,null,null,null,"Total for Object Code:",null,{"$f":"SUM(M109:M114)","v":0}]
[]
[]
["Page 18"]
[null,null,null,null,"School Division:",null,{"$f":"'Title III Budget'!A16","v":"ALBEMARLE COUNTY PUBLIC SCHOOLS"},null,null,null,null,"Division Number:",{"$f":"'Title III Budget'!H16","v":2}]
["DETAILED BUDGET DESCRIPTION OF OBJECT CODE 5000"]
["Provide a description for expenses related to object code 5000.  Include expenditures that support the use of programs. Includes expenditures that support the program, staff/administrative/consultant travel, office phone charges, training, leases/rental, indirect cost, and other."]
[]
[]
["Item Description",null,null,null,null,null,null,null,null,null,"Funding Source",null,"Total Cost"]
[]
[]
[]
[]
[]
[]
[]
[]
[null,null,null,null,"      ",null,null,null,null,null,"Total for Object Code:",null,{"$f":"SUM(M125:M132)","v":0}]
[]
[]
["DETAILED BUDGET DESCRIPTION OF OBJECT CODE 6000"]
["Provide a description of materials, supplies, and all equipment less $5,000 per unit.  Indicate the estimated quantity of each item."]
[]
[]
["Item Description",null,null,null,null,null,null,null,"Funding Source",null,"Quantities",null,"Total Cost"]
[]
[]
[]
[]
[]
[]
[]
[]
[]
[]
[]
[]
[]
[]
[]
[]
[null,null,null,null,"      ",null,null,null,null,null,"Total for Object Code:",null,{"$f":"SUM(M141:M156)","v":0}]
[]
["Page 19"]
[null,null,null,null,"School Division:",null,{"$f":"'Title III Budget'!A16","v":"ALBEMARLE COUNTY PUBLIC SCHOOLS"},null,null,null,null,"Division Number:",{"$f":"'Title III Budget'!H16","v":2}]
["DETAILED BUDGET DESCRIPTION OF OBJECT CODE 8000"]
["Provide a description for expenses related to object code 8000 not included in the justification above.  All capital outlay expenditures over $5,000 per unit must be approved in advance by the Department of Education. If the school division has established a threshold of a lesser amount, items equal to that amount or greater must also receive prior approval by the Department of Education.  Equipment quantities must be specified."]
[]
[]
["Item Description",null,null,null,null,null,null,null,"Funding Source",null,"Quantities",null,"Total Cost"]
[]
[]
[]
[]
[]
[]
[]
[]
[]
[]
[null,null,null,null,"      ",null,null,null,null,null,"Total for Object Code:",null,{"$f":"SUM(M166:M175)","v":0}]
[]
[]
["Page 20"]

{"sheet":"Title III Program","index":2,"n_rows":148,"n_cols":16369,"rows_kept":148,"cut":false,"hidden":false,"merged":[[134,0,134,11],[135,0,135,11],[136,0,136,11],[137,0,137,11],[138,0,138,11],[139,0,139,11],[140,0,140,11],[141,0,141,11],[142,0,142,11],[143,0,143,11],[144,0,144,11],[145,0,145,11],[125,0,125,15],[122,0,122,15],[48,112,48,127],[48,128,48,143],[119,0,119,15],[126,0,126,15],[144,12,144,14],[66,0,66,15],[77,0,77,15],[78,0,78,15],[79,0,79,15],[115,0,115,15],[57,0,57,15],[61,0,61,15],[56,0,56,15],[52,0,52,15],[53,0,53,15],[65,0,65,15],[130,0,130,15],[132,0,132,15],[59,0,59,15],[118,0,118,15],[121,0,121,15],[123,0,123,15],[117,0,117,15],[124,0,124,15],[113,0,113,15],[69,0,69,15],[73,0,73,15],[74,0,74,15],[75,0,75,15],[76,0,76,15],[16,112,16,127],[36,48,36,63],[36,64,36,79],[36,80,36,95],[36,96,36,111],[36,112,36,127],[24,1,24,11],[55,0,55,15],[50,0,50,15],[49,0,49,15],[48,32,48,47],[48,48,48,63],[48,64,48,79],[48,80,48,95],[104,0,104,15],[105,0,105,15],[106,0,106,15],[107,0,107,15],[108,0,108,15],[109,0,109,15],[1,0,1,15],[6,0,6,15],[37,0,37,15],[11,0,11,15],[3,0,3,15],[8,0,8,15],[26,0,26,15],[44,0,44,15],[7,0,7,15],[12,0,12,15],[9,0,9,15],[31,0,31,15],[5,0,5,16383],[18,0,18,15],[20,0,20,15],[21,1,21,11],[22,1,22,11],[36,128,36,143],[36,144,36,159],[36,160,36,175],[36,176,36,191],[21,12,21,14],[22,12,22,14],[23,12,23,14],[24,12,24,14],[29,0,29,15],[32,0,32,15],[42,0,42,15],[16,560,16,575],[16,576,16,591],[16,592,16,607],[16,608,16,623],[48,144,48,159],[48,160,48,175],[38,0,38,15],[43,0,43,15],[40,0,40,15],[45,0,45,15],[48,0,48,15],[48,16,48,31],[48,96,48,111],[48,176,48,191],[147,0,147,15],[141,12,141,14],[134,12,134,14],[135,12,135,14],[13,0,13,15],[33,0,33,15],[16,16,16,31],[16,32,16,47],[16,48,16,63],[16,64,16,79],[16,80,16,95],[16,96,16,111],[114,0,114,15],[112,0,112,15],[120,0,120,15],[142,12,142,14],[143,12,143,14],[23,1,23,11],[64,0,64,15],[145,12,145,14],[133,0,133,15],[136,12,136,14],[137,12,137,14],[138,12,138,14],[139,12,139,14],[140,12,140,14],[36,0,36,15],[36,16,36,31],[36,32,36,47],[16,0,16,15],[62,0,62,15],[128,0,128,15],[16,336,16,351],[16,352,16,367],[16,368,16,383],[16,384,16,399],[16,400,16,415],[16,128,16,143],[16,144,16,159],[16,160,16,175],[16,176,16,191],[16,192,16,207],[16,208,16,223],[16,224,16,239],[16,240,16,255],[16,256,16,271],[16,272,16,287],[16,288,16,303],[16,304,16,319],[16,320,16,335],[36,192,36,207],[36,208,36,223],[36,224,36,239],[36,240,36,255],[16,624,16,639],[16,640,16,655],[16,656,16,671],[16,672,16,687],[16,688,16,703],[16,416,16,431],[16,432,16,447],[16,448,16,463],[16,464,16,479],[16,480,16,495],[16,496,16,511],[16,512,16,527],[16,528,16,543],[16,544,16,559],[16,848,16,863],[16,864,16,879],[16,880,16,895],[16,896,16,911],[16,912,16,927],[16,928,16,943],[16,944,16,959],[16,960,16,975],[16,976,16,991],[16,704,16,719],[16,720,16,735],[16,736,16,751],[16,752,16,767],[16,768,16,783],[16,784,16,799],[16,800,16,815],[16,816,16,831],[16,832,16,847],[16,1136,16,1151],[16,1152,16,1167],[16,1248,16,1263],[16,1264,16,1279],[16,992,16,1007],[16,1008,16,1023],[16,1024,16,1039],[16,1040,16,1055],[16,1056,16,1071],[16,1072,16,1087],[16,1088,16,1103],[16,1104,16,1119],[16,1120,16,1135],[16,1568,16,1583],[16,1584,16,1599],[16,1600,16,1615],[16,1616,16,1631],[16,1632,16,1647],[16,1648,16,1663],[16,1424,16,1439],[16,1280,16,1295],[16,1296,16,1311],[16,1312,16,1327],[16,1328,16,1343],[16,1344,16,1359],[16,1360,16,1375],[16,1376,16,1391],[16,1392,16,1407],[16,1408,16,1423],[16,1168,16,1183],[16,1184,16,1199],[16,1200,16,1215],[16,1216,16,1231],[16,1232,16,1247],[16,1664,16,1679],[16,1680,16,1695],[16,1696,16,1711],[16,1440,16,1455],[16,1456,16,1471],[16,1472,16,1487],[16,1488,16,1503],[16,1504,16,1519],[16,1520,16,1535],[16,1536,16,1551],[16,1552,16,1567],[16,1856,16,1871],[16,1872,16,1887],[16,1888,16,1903],[16,1904,16,1919],[16,1920,16,1935],[16,1936,16,1951],[16,1952,16,1967],[16,1968,16,1983],[16,1984,16,1999],[16,1712,16,1727],[16,1728,16,1743],[16,1744,16,1759],[16,1760,16,1775],[16,1776,16,1791],[16,1792,16,1807],[16,1808,16,1823],[16,1824,16,1839],[16,1840,16,1855],[16,2144,16,2159],[16,2160,16,2175],[16,2176,16,2191],[16,2192,16,2207],[16,2208,16,2223],[16,2224,16,2239],[16,2240,16,2255],[16,2256,16,2271],[16,2272,16,2287],[16,2000,16,2015],[16,2016,16,2031],[16,2032,16,2047],[16,2048,16,2063],[16,2064,16,2079],[16,2080,16,2095],[16,2096,16,2111],[16,2112,16,2127],[16,2128,16,2143],[16,2432,16,2447],[16,2448,16,2463],[16,2464,16,2479],[16,2480,16,2495],[16,2496,16,2511],[16,2512,16,2527],[16,2528,16,2543],[16,2544,16,2559],[16,2560,16,2575],[16,2288,16,2303],[16,2304,16,2319],[16,2320,16,2335],[16,2336,16,2351],[16,2352,16,2367],[16,2368,16,2383],[16,2384,16,2399],[16,2400,16,2415],[16,2416,16,2431],[16,2720,16,2735],[16,2736,16,2751],[16,2752,16,2767],[16,2768,16,2783],[16,2784,16,2799],[16,2800,16,2815],[16,2816,16,2831],[16,2832,16,2847],[16,2848,16,2863],[16,2576,16,2591],[16,2592,16,2607],[16,2608,16,2623],[16,2624,16,2639],[16,2640,16,2655],[16,2656,16,2671],[16,2672,16,2687],[16,2688,16,2703],[16,2704,16,2719],[16,3008,16,3023],[16,3024,16,3039],[16,3040,16,3055],[16,3056,16,3071],[16,3072,16,3087],[16,3088,16,3103],[16,3104,16,3119],[16,3120,16,3135],[16,3136,16,3151],[16,2864,16,2879],[16,2880,16,2895],[16,2896,16,2911],[16,2912,16,2927],[16,2928,16,2943],[16,2944,16,2959],[16,2960,16,2975],[16,2976,16,2991],[16,2992,16,3007],[16,3296,16,3311],[16,3312,16,3327],[16,3328,16,3343],[16,3344,16,3359],[16,3360,16,3375],[16,3376,16,3391],[16,3392,16,3407],[16,3408,16,3423],[16,3424,16,3439],[16,3152,16,3167],[16,3168,16,3183],[16,3184,16,3199],[16,3200,16,3215],[16,3216,16,3231],[16,3232,16,3247],[16,3248,16,3263],[16,3264,16,3279],[16,3280,16,3295],[16,3584,16,3599],[16,3600,16,3615],[16,3616,16,3631],[16,3632,16,3647],[16,3648,16,3663],[16,3664,16,3679],[16,3680,16,3695],[16,3696,16,3711],[16,3712,16,3727],[16,3440,16,3455],[16,3456,16,3471],[16,3472,16,3487],[16,3488,16,3503],[16,3504,16,3519],[16,3520,16,3535],[16,3536,16,3551],[16,3552,16,3567],[16,3568,16,3583],[16,3872,16,3887],[16,3888,16,3903],[16,3904,16,3919],[16,3920,16,3935],[16,3936,16,3951],[16,3952,16,3967],[16,3968,16,3983],[16,3984,16,3999],[16,4000,16,4015],[16,3728,16,3743],[16,3744,16,3759],[16,3760,16,3775],[16,3776,16,3791],[16,3792,16,3807],[16,3808,16,3823],[16,3824,16,3839],[16,3840,16,3855],[16,3856,16,3871],[16,4160,16,4175],[16,4176,16,4191],[16,4192,16,4207],[16,4208,16,4223],[16,4224,16,4239],[16,4240,16,4255],[16,4256,16,4271],[16,4272,16,4287],[16,4288,16,4303],[16,4016,16,4031],[16,4032,16,4047],[16,4048,16,4063],[16,4064,16,4079],[16,4080,16,4095],[16,4096,16,4111],[16,4112,16,4127],[16,4128,16,4143],[16,4144,16,4159],[16,4448,16,4463],[16,4464,16,4479],[16,4480,16,4495],[16,4496,16,4511],[16,4512,16,4527],[16,4528,16,4543],[16,4544,16,4559],[16,4560,16,4575],[16,4576,16,4591],[16,4304,16,4319],[16,4320,16,4335],[16,4336,16,4351],[16,4352,16,4367],[16,4368,16,4383],[16,4384,16,4399],[16,4400,16,4415],[16,4416,16,4431],[16,4432,16,4447],[16,4736,16,4751],[16,4752,16,4767],[16,4768,16,4783],[16,4784,16,4799],[16,4800,16,4815],[16,4816,16,4831],[16,4832,16,4847],[16,4848,16,4863],[16,4864,16,4879],[16,4592,16,4607],[16,4608,16,4623],[16,4624,16,4639],[16,4640,16,4655],[16,4656,16,4671],[16,4672,16,4687],[16,4688,16,4703],[16,4704,16,4719],[16,4720,16,4735],[16,5024,16,5039],[16,5040,16,5055],[16,5056,16,5071],[16,5072,16,5087],[16,5088,16,5103],[16,5104,16,5119],[16,5120,16,5135],[16,5136,16,5151],[16,5152,16,5167],[16,4880,16,4895],[16,4896,16,4911],[16,4912,16,4927],[16,4928,16,4943],[16,4944,16,4959],[16,4960,16,4975],[16,4976,16,4991],[16,4992,16,5007],[16,5008,16,5023],[16,5312,16,5327],[16,5328,16,5343],[16,5344,16,5359],[16,5360,16,5375],[16,5376,16,5391],[16,5392,16,5407],[16,5408,16,5423],[16,5424,16,5439],[16,5440,16,5455],[16,5168,16,5183],[16,5184,16,5199],[16,5200,16,5215],[16,5216,16,5231],[16,5232,16,5247],[16,5248,16,5263],[16,5264,16,5279],[16,5280,16,5295],[16,5296,16,5311],[16,5600,16,5615],[16,5616,16,5631],[16,5632,16,5647],[16,5648,16,5663],[16,5664,16,5679],[16,5680,16,5695],[16,5696,16,5711],[16,5712,16,5727],[16,5728,16,5743],[16,5456,16,5471],[16,5472,16,5487],[16,5488,16,5503],[16,5504,16,5519],[16,5520,16,5535],[16,5536,16,5551],[16,5552,16,5567],[16,5568,16,5583],[16,5584,16,5599],[16,5888,16,5903],[16,5904,16,5919],[16,5920,16,5935],[16,5936,16,5951],[16,5952,16,5967],[16,5968,16,5983],[16,5984,16,5999],[16,6000,16,6015],[16,6016,16,6031],[16,5744,16,5759],[16,5760,16,5775],[16,5776,16,5791],[16,5792,16,5807],[16,5808,16,5823],[16,5824,16,5839],[16,5840,16,5855],[16,5856,16,5871],[16,5872,16,5887],[16,6176,16,6191],[16,6192,16,6207],[16,6208,16,6223],[16,6224,16,6239],[16,6240,16,6255],[16,6256,16,6271],[16,6272,16,6287],[16,6288,16,6303],[16,6304,16,6319],[16,6032,16,6047],[16,6048,16,6063],[16,6064,16,6079],[16,6080,16,6095],[16,6096,16,6111],[16,6112,16,6127],[16,6128,16,6143],[16,6144,16,6159],[16,6160,16,6175],[16,6464,16,6479],[16,6480,16,6495],[16,6496,16,6511],[16,6512,16,6527],[16,6528,16,6543],[16,6544,16,6559],[16,6560,16,6575],[16,6576,16,6591],[16,6592,16,6607],[16,6320,16,6335],[16,6336,16,6351],[16,6352,16,6367],[16,6368,16,6383],[16,6384,16,6399],[16,6400,16,6415],[16,6416,16,6431],[16,6432,16,6447],[16,6448,16,6463],[16,6752,16,6767],[16,6768,16,6783],[16,6784,16,6799],[16,6800,16,6815],[16,6816,16,6831],[16,6832,16,6847],[16,6848,16,6863],[16,6864,16,6879],[16,6880,16,6895],[16,6608,16,6623],[16,6624,16,6639],[16,6640,16,6655],[16,6656,16,6671],[16,6672,16,6687],[16,6688,16,6703],[16,6704,16,6719],[16,6720,16,6735],[16,6736,16,6751],[16,7040,16,7055],[16,7056,16,7071],[16,7072,16,7087],[16,7088,16,7103],[16,7104,16,7119],[16,7120,16,7135],[16,7136,16,7151],[16,7152,16,7167],[16,7168,16,7183],[16,6896,16,6911],[16,6912,16,6927],[16,6928,16,6943],[16,6944,16,6959],[16,6960,16,6975],[16,6976,16,6991],[16,6992,16,7007],[16,7008,16,7023],[16,7024,16,7039],[16,7328,16,7343],[16,7344,16,7359],[16,7360,16,7375],[16,7376,16,7391],[16,7392,16,7407],[16,7408,16,7423],[16,7424,16,7439],[16,7440,16,7455],[16,7456,16,7471],[16,7184,16,7199],[16,7200,16,7215],[16,7216,16,7231],[16,7232,16,7247],[16,7248,16,7263],[16,7264,16,7279],[16,7280,16,7295],[16,7296,16,7311],[16,7312,16,7327],[16,7616,16,7631],[16,7632,16,7647],[16,7648,16,7663],[16,7664,16,7679],[16,7680,16,7695],[16,7696,16,7711],[16,7712,16,7727],[16,7728,16,7743],[16,7744,16,7759],[16,7472,16,7487],[16,7488,16,7503],[16,7504,16,7519],[16,7520,16,7535],[16,7536,16,7551],[16,7552,16,7567],[16,7568,16,7583],[16,7584,16,7599],[16,7600,16,7615],[16,7904,16,7919],[16,7920,16,7935],[16,7936,16,7951],[16,7952,16,7967],[16,7968,16,7983],[16,7984,16,7999],[16,8000,16,8015],[16,8016,16,8031],[16,8032,16,8047],[16,7760,16,7775],[16,7776,16,7791],[16,7792,16,7807],[16,7808,16,7823],[16,7824,16,7839],[16,7840,16,7855],[16,7856,16,7871],[16,7872,16,7887],[16,7888,16,7903],[16,8192,16,8207],[16,8208,16,8223],[16,8224,16,8239],[16,8240,16,8255],[16,8256,16,8271],[16,8272,16,8287],[16,8288,16,8303],[16,8304,16,8319],[16,8320,16,8335],[16,8048,16,8063],[16,8064,16,8079],[16,8080,16,8095],[16,8096,16,8111],[16,8112,16,8127],[16,8128,16,8143],[16,8144,16,8159],[16,8160,16,8175],[16,8176,16,8191],[16,8480,16,8495],[16,8496,16,8511],[16,8512,16,8527],[16,8528,16,8543],[16,8544,16,8559],[16,8560,16,8575],[16,8576,16,8591],[16,8592,16,8607],[16,8608,16,8623],[16,8336,16,8351],[16,8352,16,8367],[16,8368,16,8383],[16,8384,16,8399],[16,8400,16,8415],[16,8416,16,8431],[16,8432,16,8447],[16,8448,16,8463],[16,8464,16,8479],[16,8768,16,8783],[16,8784,16,8799],[16,8800,16,8815],[16,8816,16,8831],[16,8832,16,8847],[16,8848,16,8863],[16,8864,16,8879],[16,8880,16,8895],[16,8896,16,8911],[16,8624,16,8639],[16,8640,16,8655],[16,8656,16,8671],[16,8672,16,8687],[16,8688,16,8703],[16,8704,16,8719],[16,8720,16,8735],[16,8736,16,8751],[16,8752,16,8767],[16,9056,16,9071],[16,9072,16,9087],[16,9088,16,9103],[16,9104,16,9119],[16,9120,16,9135],[16,9136,16,9151],[16,9152,16,9167],[16,9168,16,9183],[16,9184,16,9199],[16,8912,16,8927],[16,8928,16,8943],[16,8944,16,8959],[16,8960,16,8975],[16,8976,16,8991],[16,8992,16,9007],[16,9008,16,9023],[16,9024,16,9039],[16,9040,16,9055],[16,9344,16,9359],[16,9360,16,9375],[16,9376,16,9391],[16,9392,16,9407],[16,9408,16,9423],[16,9424,16,9439],[16,9440,16,9455],[16,9456,16,9471],[16,9472,16,9487],[16,9200,16,9215],[16,9216,16,9231],[16,9232,16,9247],[16,9248,16,9263],[16,9264,16,9279],[16,9280,16,9295],[16,9296,16,9311],[16,9312,16,9327],[16,9328,16,9343],[16,9632,16,9647],[16,9648,16,9663],[16,9664,16,9679],[16,9680,16,9695],[16,9696,16,9711],[16,9712,16,9727],[16,9728,16,9743],[16,9744,16,9759],[16,9760,16,9775],[16,9488,16,9503],[16,9504,16,9519],[16,9520,16,9535],[16,9536,16,9551],[16,9552,16,9567],[16,9568,16,9583],[16,9584,16,9599],[16,9600,16,9615],[16,9616,16,9631],[16,9920,16,9935],[16,9936,16,9951],[16,9952,16,9967],[16,9968,16,9983],[16,9984,16,9999],[16,10000,16,10015],[16,10016,16,10031],[16,10032,16,10047],[16,10048,16,10063],[16,9776,16,9791],[16,9792,16,9807],[16,9808,16,9823],[16,9824,16,9839],[16,9840,16,9855],[16,9856,16,9871],[16,9872,16,9887],[16,9888,16,9903],[16,9904,16,9919],[16,10208,16,10223],[16,10224,16,10239],[16,10240,16,10255],[16,10256,16,10271],[16,10272,16,10287],[16,10288,16,10303],[16,10304,16,10319],[16,10320,16,10335],[16,10336,16,10351],[16,10064,16,10079],[16,10080,16,10095],[16,10096,16,10111],[16,10112,16,10127],[16,10128,16,10143],[16,10144,16,10159],[16,10160,16,10175],[16,10176,16,10191],[16,10192,16,10207],[16,10496,16,10511],[16,10512,16,10527],[16,10528,16,10543],[16,10544,16,10559],[16,10560,16,10575],[16,10576,16,10591],[16,10592,16,10607],[16,10608,16,10623],[16,10624,16,10639],[16,10352,16,10367],[16,10368,16,10383],[16,10384,16,10399],[16,10400,16,10415],[16,10416,16,10431],[16,10432,16,10447],[16,10448,16,10463],[16,10464,16,10479],[16,10480,16,10495],[16,10784,16,10799],[16,10800,16,10815],[16,10816,16,10831],[16,10832,16,10847],[16,10848,16,10863],[16,10864,16,10879],[16,10880,16,10895],[16,10896,16,10911],[16,10912,16,10927],[16,10640,16,10655],[16,10656,16,10671],[16,10672,16,10687],[16,10688,16,10703],[16,10704,16,10719],[16,10720,16,10735],[16,10736,16,10751],[16,10752,16,10767],[16,10768,16,10783],[16,11072,16,11087],[16,11088,16,11103],[16,11104,16,11119],[16,11120,16,11135],[16,11136,16,11151],[16,11152,16,11167],[16,11168,16,11183],[16,11184,16,11199],[16,11200,16,11215],[16,10928,16,10943],[16,10944,16,10959],[16,10960,16,10975],[16,10976,16,10991],[16,10992,16,11007],[16,11008,16,11023],[16,11024,16,11039],[16,11040,16,11055],[16,11056,16,11071],[16,11360,16,11375],[16,11376,16,11391],[16,11392,16,11407],[16,11408,16,11423],[16,11424,16,11439],[16,11440,16,11455],[16,11456,16,11471],[16,11472,16,11487],[16,11488,16,11503],[16,11216,16,11231],[16,11232,16,11247],[16,11248,16,11263],[16,11264,16,11279],[16,11280,16,11295],[16,11296,16,11311],[16,11312,16,11327],[16,11328,16,11343],[16,11344,16,11359],[16,11648,16,11663],[16,11664,16,11679],[16,11680,16,11695],[16,11696,16,11711],[16,11712,16,11727],[16,11728,16,11743],[16,11744,16,11759],[16,11760,16,11775],[16,11776,16,11791],[16,11504,16,11519],[16,11520,16,11535],[16,11536,16,11551],[16,11552,16,11567],[16,11568,16,11583],[16,11584,16,11599],[16,11600,16,11615],[16,11616,16,11631],[16,11632,16,11647],[16,11936,16,11951],[16,11952,16,11967],[16,11968,16,11983],[16,11984,16,11999],[16,12000,16,12015],[16,12016,16,12031],[16,12032,16,12047],[16,12048,16,12063],[16,12064,16,12079],[16,11792,16,11807],[16,11808,16,11823],[16,11824,16,11839],[16,11840,16,11855],[16,11856,16,11871],[16,11872,16,11887],[16,11888,16,11903],[16,11904,16,11919],[16,11920,16,11935],[16,12224,16,12239],[16,12240,16,12255],[16,12256,16,12271],[16,12272,16,12287],[16,12288,16,12303],[16,12304,16,12319],[16,12320,16,12335],[16,12336,16,12351],[16,12352,16,12367],[16,12080,16,12095],[16,12096,16,12111],[16,12112,16,12127],[16,12128,16,12143],[16,12144,16,12159],[16,12160,16,12175],[16,12176,16,12191],[16,12192,16,12207],[16,12208,16,12223],[16,12512,16,12527],[16,12528,16,12543],[16,12544,16,12559],[16,12560,16,12575],[16,12576,16,12591],[16,12592,16,12607],[16,12608,16,12623],[16,12624,16,12639],[16,12640,16,12655],[16,12368,16,12383],[16,12384,16,12399],[16,12400,16,12415],[16,12416,16,12431],[16,12432,16,12447],[16,12448,16,12463],[16,12464,16,12479],[16,12480,16,12495],[16,12496,16,12511],[16,12800,16,12815],[16,12816,16,12831],[16,12832,16,12847],[16,12848,16,12863],[16,12864,16,12879],[16,12880,16,12895],[16,12896,16,12911],[16,12912,16,12927],[16,12928,16,12943],[16,12656,16,12671],[16,12672,16,12687],[16,12688,16,12703],[16,12704,16,12719],[16,12720,16,12735],[16,12736,16,12751],[16,12752,16,12767],[16,12768,16,12783],[16,12784,16,12799],[16,13088,16,13103],[16,13104,16,13119],[16,13120,16,13135],[16,13136,16,13151],[16,13152,16,13167],[16,13168,16,13183],[16,13184,16,13199],[16,13200,16,13215],[16,13216,16,13231],[16,12944,16,12959],[16,12960,16,12975],[16,12976,16,12991],[16,12992,16,13007],[16,13008,16,13023],[16,13024,16,13039],[16,13040,16,13055],[16,13056,16,13071],[16,13072,16,13087],[16,13376,16,13391],[16,13392,16,13407],[16,13408,16,13423],[16,13424,16,13439],[16,13440,16,13455],[16,13456,16,13471],[16,13472,16,13487],[16,13488,16,13503],[16,13504,16,13519],[16,13232,16,13247],[16,13248,16,13263],[16,13264,16,13279],[16,13280,16,13295],[16,13296,16,13311],[16,13312,16,13327],[16,13328,16,13343],[16,13344,16,13359],[16,13360,16,13375],[16,13664,16,13679],[16,13680,16,13695],[16,13696,16,13711],[16,13712,16,13727],[16,13728,16,13743],[16,13744,16,13759],[16,13760,16,13775],[16,13776,16,13791],[16,13792,16,13807],[16,13520,16,13535],[16,13536,16,13551],[16,13552,16,13567],[16,13568,16,13583],[16,13584,16,13599],[16,13600,16,13615],[16,13616,16,13631],[16,13632,16,13647],[16,13648,16,13663],[16,13952,16,13967],[16,13968,16,13983],[16,13984,16,13999],[16,14000,16,14015],[16,14016,16,14031],[16,14032,16,14047],[16,14048,16,14063]],"merged_total":3201,"flags":["merged_cut"]}
[null,null,null,null,"School Division:",null,{"$f":"'Title III Budget'!$A$16","v":"ALBEMARLE COUNTY PUBLIC SCHOOLS"},null,null,null,null,null,"Division Number:",null,null,{"$f":"'Title III Budget'!$H$16","v":2}]
["E.  PROGRAMS AND SERVICES FOR ELs AND THEIR FAMILIES"]
[]
["Federal Civil Rights Requirements\nDivisions must provide programs and services for the education of English Learners (ELs) under Title VI of the Civil Rights Act of 1964, the Equal Educational Opportunities Act of 1974 (EEOA), Lau v Nichols (1974), Castañeda v Pickard (1981) and other civil rights laws and federal statutes and guidance.  Federal funds, including Title III, cannot be used to meet the federal requirements for ELs. Under the Castañeda standards, programs and services for ELs should: 1) be based on effective education theory and/or research recognized by legitimate experts in the field; 2) be implemented with fidelity and adequate resources to ensure a realistic chance of success within a reasonable timeframe; and 3) lead to improved academic outcomes within this reasonable timeframe.  \n"]
[]
["Description of an Effective LIEP Supported by Local and/or State Funds: The division must implement an effective language instruction educational program (LIEP) in order to meet the needs of ELs and demonstrate success in increasing their English language proficiency and student academic achievement."]
[]
["Narrative Boxes:"]
["Box 1:  Using Local and/or State Funds: Describe how instruction is delivered to ELs at varying proficiency levels and grade span levels to develop their English language skills and increase their ability to meet challenging State academic standards. Include specialized programs for newcomer ELs, “opt-out” ELs, dually-identified ELs, ELs at higher proficiency levels, long-term ELs, if applicable.  "]
["English Learners (ELs) in the Albemarle County Public Schools (ACPS) English for Speakers of Other Languages (ESOL) program receive customized, targeted instruction and feedback so that they can become fully proficient in English while learning the same rigorous academic content as their native English-speaking peers. ACPS does not subscribe to a single instructional model, as no single approach is appropriate for all ELs. ACPS ESOL teachers respond to students’ needs by implementing research-based practices for interactive instruction, and advocating for language and content objectives and appropriate scaffolds to be included in ELs’ daily lessons. \n\nWe have implemented an ESOL Advisor approach, where ESOL teachers are the advocate for supports and services needed by students beyond the Language Instruction Educational Programs (LIEPs) of (1) English as Second Language (ESL) or English Language Development (ELD), which includes Advisory for Long-Term ELs, (2) Content Classes with integrated ESL support, which typically includes Dually Identified ELs, (3) Newcomer Program, which is differentiated for Students with Limited or Interrupted Formal Education (SLIFE), (4) Traditional Bilingual, and (5) Dual Language or Two-way Immersion. Our ESOL Advisor approach allows students to remain in advanced and honors classes with their peers, and thus minimizes the number of opt-out ELs.  Finally, ESOL teachers monitor the academic progress of Formerly ELs and support them in collaboratively selecting and implementing their Standards of Learning (SOL) testing accommodations in the classroom.\n\n"]
[]
["Box 2:  Using Local and/or State Funds:  Describe the division’s plan to provide effective professional development that specifically relates to the identification and teaching of ELs as identified in Box 1.  "]
["The Title III Coordinator works closely with the Director of Professional Learning for ACPS to address areas of need related to teaching ELs. These needs are based on the results of the ongoing ESOL Program Evaluation Process that includes: classroom walkthroughs with school administrators; conversations with teachers of ELs during ESOL classes; interactions with families and educational partners at family and community engagement events; and teacher discussions during Professional Learning Communities (PLCs) and Professional Development (PD) workshops.\n\nOnce areas of focus are identified, ESOL and content teacher teams collaborate to build professional learning sessions for colleagues. Additional PD workshops are offered as ACPS Opportunities Courses to all teachers across the division. An intentional effort is made to include PD workshops that support best instructional practices for teachers of ELs. With this mindset, we strive to help all educators see themselves as teachers of ELs and build their understanding, skills, and capacities to meet ELs’ needs.\n\nWe use the Title III application process to formally synthesize and summarize all quantitative and quantitative data in order to make programmatic decisions for the upcoming academic year, including coordination with the ACPS PD department. For example, based on trends noticed across schools, we designed and delivered PD sessions on interpretation and translation, supporting Dually Identified ELs, Culturally Responsive Teaching, accelerating ELs’ language acquisition in the content areas, and academic language strategies.\n"]
["Page 21"]
[null,null,null,null,"School Division:",null,{"$f":"'Title III Budget'!$A$16","v":"ALBEMARLE COUNTY PUBLIC SCHOOLS"},null,null,null,null,null,"Division Number:",null,null,{"$f":"'Title III Budget'!$H$16","v":2}]
[]
["E.  PROGRAMS AND SERVICES FOR ELs AND THEIR FAMILIES (CONTINUED)",null,null,null,null,null,null,null,null,null,null,null,null,null,null,null,null,null,null,null,null,null,null,null,null,null,null,null,null,null,null,null,"E.  PROGRAMS AND SERVICES FOR ELs AND THEIR FAMILIES (CONTINUED)",null,null,null,null,null,null,null,null,null,null,null,null,null,null,null,"E.  PROGRAMS AND SERVICES FOR ELs AND THEIR FAMILIES (CONTINUED)",null,null,null,null,null,null,null,null,null,null,null,null,null,null,null,"E.  PROGRAMS AND SERVICES FOR ELs AND THEIR FAMILIES (CONTINUED)",null,null,null,null,null,null,null,null,null,null,null,null,null,null,null,"E.  PROGRAMS AND SERVICES FOR ELs AND THEIR FAMILIES (CONTINUED)",null,null,null,null,null,null,null,null,null,null,null,null,null,null,null,"E.  PROGRAMS AND SERVICES FOR ELs AND THEIR FAMILIES (CONTINUED)",null,null,null,null,null,null,null,null,null,null,null,null,null,null,null,"E.  PROGRAMS AND SERVICES FOR ELs AND THEIR FAMILIES (CONTINUED)",null,null,null,null,null,null,null,null,null,null,null,null,null,null,null,"E.  PROGRAMS AND SERVICES FOR ELs AND THEIR FAMILIES (CONTINUED)",null,null,null,null,null,null,null,null,null,null,null,null,null,null,null,"E.  PROGRAMS AND SERVICES FOR ELs AND THEIR FAMILIES (CONTINUED)",null,null,null,null,null,null,null,null,null,null,null,null,null,null,null,"E.  PROGRAMS AND SERVICES FOR ELs AND THEIR FAMILIES (CONTINUED)",null,null,null,null,null,null,null,null,null,null,null,null,null,null,null,"E.  PROGRAMS AND SERVICES FOR ELs AND THEIR FAMILIES (CONTINUED)",null,null,null,null,null,null,null,null,null,null,null,null,null,null,null,"E.  PROGRAMS AND SERVICES FOR ELs AND THEIR FAMILIES (CONTINUED)",null,null,null,null,null,null,null,null,null,null,null,null,null,null,null,"E.  PROGRAMS AND SERVICES FOR ELs AND THEIR FAMILIES (CONTINUED)",null,null,null,null,null,null,null,null,null,null,null,null,null,null,null,"E.  PROGRAMS AND SERVICES FOR ELs AND THEIR FAMILIES (CONTINUED)",null,null,null,null,null,null,null,null,null,null,null,null,null,null,null,"E.  PROGRAMS AND SERVICES FOR ELs AND THEIR FAMILIES (CONTINUED)",null,null,null,null,null,null,null,null,null,null,null,null,null,null,null,"E.  PROGRAMS AND SERVICES FOR ELs AND THEIR FAMILIES (CONTINUED)",null,null,null,null,null,null,null,null,null,null,null,null,null,null,null,"E.  PROGRAMS AND SERVICES FOR ELs AND THEIR FAMILIES (CONTINUED)",null,null,null,null,null,null,null,null,null,null,null,null,null,null,null,"E.  PROGRAMS AND SERVICES FOR ELs AND THEIR FAMILIES (CONTINUED)",null,null,null,null,null,null,null,null,null,null,null,null,null,null,null,"E.  PROGRAMS AND SERVICES FOR ELs AND THEIR FAMILIES (CONTINUED)",null,null,null,null,null,null,null,null,null,null,null,null,null,null,null,"E.  PROGRAMS AND SERVICES FOR ELs AND THEIR FAMILIES (CONTINUED)",null,null,null,null,null,null,null,null,null,null,null,null,null,null,null,"E.  PROGRAMS AND SERVICES FOR ELs AND THEIR FAMILIES (CONTINUED)",null,null,null,null,null,null,null,null,null,null,null,null,null,null,null,"E.  PROGRAMS AND SERVICES FOR ELs AND THEIR FAMILIES (CONTINUED)",null,null,null,null,null,null,null,null,null,null,null,null,null,null,null,"E.  PROGRAMS AND SERVICES FOR ELs AND THEIR FAMILIES (CONTINUED)",null,null,null,null,null,null,null,null,null,null,null,null,null,null,null,"E.  PROGRAMS AND SERVICES FOR ELs AND THEIR FAMILIES (CONTINUED)",null,null,null,null,null,null,null,null,null,null,null,null,null,null,null,"E.  PROGRAMS AND SERVICES FOR ELs AND THEIR FAMILIES (CONTINUED)",null,null,null,null,null,null,null,null,null,null,null,null,null,null,null,"E.  PROGRAMS AND SERVICES FOR ELs AND THEIR FAMILIES (CONTINUED)",null,null,null,null,null,null,null,null,null,null,null,null,null,null,null,"E.  PROGRAMS AND SERVICES FOR ELs AND THEIR FAMILIES (CONTINUED)",null,null,null,null,null,null,null,null,null,null,null,null,null,null,null,"E.  PROGRAMS AND SERVICES FOR ELs AND THEIR FAMILIES (CONTINUED)",null,null,null,null,null,null,null,null,null,null,null,null,null,null,null,"E.  PROGRAMS AND SERVICES FOR ELs AND THEIR FAMILIES (CONTINUED)",null,null,null,null,null,null,null,null,null,null,null,null,null,null,null,"E.  PROGRAMS AND SERVICES FOR ELs AND THEIR FAMILIES (CONTINUED)",null,null,null,null,null,null,null,null,null,null,null,null,null,null,null,"E.  PROGRAMS AND SERVICES FOR ELs AND THEIR FAMILIES (CONTINUED)",null,null,null,null,null,null,null,null,null,null,null,null,null,null,null,"E.  PROGRAMS AND SERVICES FOR ELs AND THEIR FAMILIES (CONTINUED)",null,null,null,null,null,null,null,null,null,null,null,null,null,null,null,"E.  PROGRAMS AND SERVICES FOR ELs AND THEIR FAMILIES (CONTINUED)",null,null,null,null,null,null,null,null,null,null,null,null,null,null,null,"E.  PROGRAMS AND SERVICES FOR ELs AND THEIR FAMILIES (CONTINUED)",null,null,null,null,null,null,null,null,null,null,null,null,null,null,null,"E.  PROGRAMS AND SERVICES FOR ELs AND THEIR FAMILIES (CONTINUED)",null,null,null,null,null,null,null,null,null,null,null,null,null,null,null,"E.  PROGRAMS AND SERVICES FOR ELs AND THEIR FAMILIES (CONTINUED)",null,null,null,null,null,null,null,null,null,null,null,null,null,null,null,"E.  PROGRAMS AND SERVICES FOR ELs AND THEIR FAMILIES (CONTINUED)",null,null,null,null,null,null,null,null,null,null,null,null,null,null,null,"E.  PROGRAMS AND SERVICES FOR ELs AND THEIR FAMILIES (CONTINUED)",null,null,null,null,null,null,null,null,null,null,null,null,null,null,null,"E.  PROGRAMS AND SERVICES FOR ELs AND THEIR FAMILIES (CONTINUED)",null,null,null,null,null,null,null,null,null,null,null,null,null,null,null,"E.  PROGRAMS AND SERVICES FOR ELs AND THEIR FAMILIES (CONTINUED)",null,null,null,null,null,null,null,null,null,null,null,null,null,null,null,"E.  PROGRAMS AND SERVICES FOR ELs AND THEIR FAMILIES (CONTINUED)",null,null,null,null,null,null,null,null,null,null,null,null,null,null,null,"E.  PROGRAMS AND SERVICES FOR ELs AND THEIR FAMILIES (CONTINUED)",null,null,null,null,null,null,null,null,null,null,null,null,null,null,null,"E.  PROGRAMS AND SERVICES FOR ELs AND THEIR FAMILIES (CONTINUED)",null,null,null,null,null,null,null,null,null,null,null,null,null,null,null,"E.  PROGRAMS AND SERVICES FOR ELs AND THEIR FAMILIES (CONTINUED)",null,null,null,null,null,null,null,null,null,null,null,null,null,null,null,"E.  PROGRAMS AND SERVICES FOR ELs AND THEIR FAMILIES (CONTINUED)",null,null,null,null,null,null,null,null,null,null,null,null,null,null,null,"E.  PROGRAMS AND SERVICES FOR ELs AND THEIR FAMILIES (CONTINUED)",null,null,null,null,null,null,null,null,null,null,null,null,null,null,null,"E.  PROGRAMS AND SERVICES FOR ELs AND THEIR FAMILIES (CONTINUED)",null,null,null,null,null,null,null,null,null,null,null,null,null,null,null,"E.  PROGRAMS AND SERVICES FOR ELs AND THEIR FAMILIES (CONTINUED)",null,null,null,null,null,null,null,null,null,null,null,null,null,null,null,"E.  PROGRAMS AND SERVICES FOR ELs AND THEIR FAMILIES (CONTINUED)",null,null,null,null,null,null,null,null,null,null,null,null,null,null,null,"E.  PROGRAMS AND SERVICES FOR ELs AND THEIR FAMILIES (CONTINUED)",null,null,null,null,null,null,null,null,null,null,null,null,null,null,null,"E.  PROGRAMS AND SERVICES FOR ELs AND THEIR FAMILIES (CONTINUED)",null,null,null,null,null,null,null,null,null,null,null,null,null,null,null,"E.  PROGRAMS AND SERVICES FOR ELs AND THEIR FAMILIES (CONTINUED)",null,null,null,null,null,null,null,null,null,null,null,null,null,null,null,"E.  PROGRAMS AND SERVICES FOR ELs AND THEIR FAMILIES (CONTINUED)",null,null,null,null,null,null,null,null,null,null,null,null,null,null,null,"E.  PROGRAMS AND SERVICES FOR ELs AND THEIR FAMILIES (CONTINUED)",null,null,null,null,null,null,null,null,null,null,null,null,null,null,null,"E.  PROGRAMS AND SERVICES FOR ELs AND THEIR FAMILIES (CONTINUED)",null,null,null,null,null,null,null,null,null,null,null,null,null,null,null,"E.  PROGRAMS AND SERVICES FOR ELs AND THEIR FAMILIES (CONTINUED)",null,null,null,null,null,null,null,null,null,null,null,null,null,null,null,"E.  PROGRAMS AND SERVICES FOR ELs AND THEIR FAMILIES (CONTINUED)",null,null,null,null,null,null,null,null,null,null,null,null,null,null,null,"E.  PROGRAMS AND SERVICES FOR ELs AND THEIR FAMILIES (CONTINUED)",null,null,null,null,null,null,null,null,null,null,null,null,null,null,null,"E.  PROGRAMS AND SERVICES FOR ELs AND THEIR FAMILIES (CONTINUED)",null,null,null,null,null,null,null,null,null,null,null,null,null,null,null,"E.  PROGRAMS AND SERVICES FOR ELs AND THEIR FAMILIES (CONTINUED)",null,null,null,null,null,null,null,null,null,null,null,null,null,null,null,"E.  PROGRAMS AND SERVICES FOR ELs AND THEIR FAMILIES (CONTINUED)",null,null,null,null,null,null,null,null,null,null,null,null,null,null,null,"E.  PROGRAMS AND SERVICES FOR ELs AND THEIR FAMILIES (CONTINUED)",null,null,null,null,null,null,null,null,null,null,null,null,null,null,null,"E.  PROGRAMS AND SERVICES FOR ELs AND THEIR FAMILIES (CONTINUED)",null,null,null,null,null,null,null,null,null,null,null,null,null,null,null,"E.  PROGRAMS AND SERVICES FOR ELs AND THEIR FAMILIES (CONTINUED)",null,null,null,null,null,null,null,null,null,null,null,null,null,null,null,"E.  PROGRAMS AND SERVICES FOR ELs AND THEIR FAMILIES (CONTINUED)",null,null,null,null,null,null,null,null,null,null,null,null,null,null,null,"E.  PROGRAMS AND SERVICES FOR ELs AND THEIR FAMILIES (CONTINUED)",null,null,null,null,null,null,null,null,null,null,null,null,null,null,null,"E.  PROGRAMS AND SERVICES FOR ELs AND THEIR FAMILIES (CONTINUED)",null,null,null,null,null,null,null,null,null,null,null,null,null,null,null,"E.  PROGRAMS AND SERVICES FOR ELs AND THEIR FAMILIES (CONTINUED)",null,null,null,null,null,null,null,null,null,null,null,null,null,null,null,"E.  PROGRAMS AND SERVICES FOR ELs AND THEIR FAMILIES (CONTINUED)",null,null,null,null,null,null,null,null,null,null,null,null,null,null,null,"E.  PROGRAMS AND SERVICES FOR ELs AND THEIR FAMILIES (CONTINUED)",null,null,null,null,null,null,null,null,null,null,null,null,null,null,null,"E.  PROGRAMS AND SERVICES FOR ELs AND THEIR FAMILIES (CONTINUED)",null,null,null,null,null,null,null,null,null,null,null,null,null,null,null,"E.  PROGRAMS AND SERVICES FOR ELs AND THEIR FAMILIES (CONTINUED)",null,null,null,null,null,null,null,null,null,null,null,null,null,null,null,"E.  PROGRAMS AND SERVICES FOR ELs AND THEIR FAMILIES (CONTINUED)",null,null,null,null,null,null,null,null,null,null,null,null,null,null,null,"E.  PROGRAMS AND SERVICES FOR ELs AND THEIR FAMILIES (CONTINUED)",null,null,null,null,null,null,null,null,null,null,null,null,null,null,null,"E.  PROGRAMS AND SERVICES FOR ELs AND THEIR FAMILIES (CONTINUED)",null,null,null,null,null,null,null,null,null,null,null,null,null,null,null,"E.  PROGRAMS AND SERVICES FOR ELs AND THEIR FAMILIES (CONTINUED)",null,null,null,null,null,null,null,null,null,null,null,null,null,null,null,"E.  PROGRAMS AND SERVICES FOR ELs AND THEIR FAMILIES (CONTINUED)",null,null,null,null,null,null,null,null,null,null,null,null,null,null,null,"E.  PROGRAMS AND SERVICES FOR ELs AND THEIR FAMILIES (CONTINUED)",null,null,null,null,null,null,null,null,null,null,null,null,null,null,null,"E.  PROGRAMS AND SERVICES FOR ELs AND THEIR FAMILIES (CONTINUED)",null,null,null,null,null,null,null,null,null,null,null,null,null,null,null,"E.  PROGRAMS AND SERVICES FOR ELs AND THEIR FAMILIES (CONTINUED)",null,null,null,null,null,null,null,null,null,null,null,null,null,null,null,"E.  PROGRAMS AND SERVICES FOR ELs AND THEIR FAMILIES (CONTINUED)",null,null,null,null,null,null,null,null,null,null,null,null,null,null,null,"E.  PROGRAMS AND SERVICES FOR ELs AND THEIR FAMILIES (CONTINUED)",null,null,null,null,null,null,null,null,null,null,null,null,null,null,null,"E.  PROGRAMS AND SERVICES FOR ELs AND THEIR FAMILIES (CONTINUED)",null,null,null,null,null,null,null,null,null,null,null,null,null,null,null,"E.  PROGRAMS AND SERVICES FOR ELs AND THEIR FAMILIES (CONTINUED)",null,null,null,null,null,null,null,null,null,null,null,null,null,null,null,"E.  PROGRAMS AND SERVICES FOR ELs AND THEIR FAMILIES (CONTINUED)",null,null,null,null,null,null,null,null,null,null,null,null,null,null,null,"E.  PROGRAMS AND SERVICES FOR ELs AND THEIR FAMILIES (CONTINUED)",null,null,null,null,null,null,null,null,null,null,null,null,null,null,null,"E.  PROGRAMS AND SERVICES FOR ELs AND THEIR FAMILIES (CONTINUED)",null,null,null,null,null,null,null,null,null,null,null,null,null,null,null,"E.  PROGRAMS AND SERVICES FOR ELs AND THEIR FAMILIES (CONTINUED)",null,null,null,null,null,null,null,null,null,null,null,null,null,null,null,"E.  PROGRAMS AND SERVICES FOR ELs AND THEIR FAMILIES (CONTINUED)",null,null,null,null,null,null,null,null,null,null,null,null,null,null,null,"E.  PROGRAMS AND SERVICES FOR ELs AND THEIR FAMILIES (CONTINUED)",null,null,null,null,null,null,null,null,null,null,null,null,null,null,null,"E.  PROGRAMS AND SERVICES FOR ELs AND THEIR FAMILIES (CONTINUED)",null,null,null,null,null,null,null,null,null,null,null,null,null,null,null,"E.  PROGRAMS AND SERVICES FOR ELs AND THEIR FAMILIES (CONTINUED)",null,null,null,null,null,null,null,null,null,null,null,null,null,null,null,"E.  PROGRAMS AND SERVICES FOR ELs AND THEIR FAMILIES (CONTINUED)",null,null,null,null,null,null,null,null,null,null,null,null,null,null,null,"E.  PROGRAMS AND SERVICES FOR ELs AND THEIR FAMILIES (CONTINUED)",null,null,null,null,null,null,null,null,null,null,null,null,null,null,null,"E.  PROGRAMS AND SERVICES FOR ELs AND THEIR FAMILIES (CONTINUED)",null,null,null,null,null,null,null,null,null,null,null,null,null,null,null,"E.  PROGRAMS AND SERVICES FOR ELs AND THEIR FAMILIES (CONTINUED)",null,null,null,null,null,null,null,null,null,null,null,null,null,null,null,"E.  PROGRAMS AND SERVICES FOR ELs AND THEIR FAMILIES (CONTINUED)",null,null,null,null,null,null,null,null,null,null,null,null,null,null,null,"E.  PROGRAMS AND SERVICES FOR ELs AND THEIR FAMILIES (CONTINUED)",null,null,null,null,null,null,null,null,null,null,null,null,null,null,null,"E.  PROGRAMS AND SERVICES FOR ELs AND THEIR FAMILIES (CONTINUED)",null,null,null,null,null,null,null,null,null,null,null,null,null,null,null,"E.  PROGRAMS AND SERVICES FOR ELs AND THEIR FAMILIES (CONTINUED)",null,null,null,null,null,null,null,null,null,null,null,null,null,null,null,"E.  PROGRAMS AND SERVICES FOR ELs AND THEIR FAMILIES (CONTINUED)",null,null,null,null,null,null,null,null,null,null,null,null,null,null,null,"E.  PROGRAMS AND SERVICES FOR ELs AND THEIR FAMILIES (CONTINUED)",null,null,null,null,null,null,null,null,null,null,null,null,null,null,null,"E.  PROGRAMS AND SERVICES FOR ELs AND THEIR FAMILIES (CONTINUED)",null,null,null,null,null,null,null,null,null,null,null,null,null,null,null,"E.  PROGRAMS AND SERVICES FOR ELs AND THEIR FAMILIES (CONTINUED)",null,null,null,null,null,null,null,null,null,null,null,null,null,null,null,"E.  PROGRAMS AND SERVICES FOR ELs AND THEIR FAMILIES (CONTINUED)",null,null,null,null,null,null,null,null,null,null,null,null,null,null,null,"E.  PROGRAMS AND SERVICES FOR ELs AND THEIR FAMILIES (CONTINUED)",null,null,null,null,null,null,null,null,null,null,null,null,null,null,null,"E.  PROGRAMS AND SERVICES FOR ELs AND THEIR FAMILIES (CONTINUED)",null,null,null,null,null,null,null,null,null,null,null,null,null,null,null,"E.  PROGRAMS AND SERVICES FOR ELs AND THEIR FAMILIES (CONTINUED)",null,null,null,null,null,null,null,null,null,null,null,null,null,null,null,"E.  PROGRAMS AND SERVICES FOR ELs AND THEIR FAMILIES (CONTINUED)",null,null,null,null,null,null,null,null,null,null,null,null,null,null,null,"E.  PROGRAMS AND SERVICES FOR ELs AND THEIR FAMILIES (CONTINUED)",null,null,null,null,null,null,null,null,null,null,null,null,null,null,null,"E.  PROGRAMS AND SERVICES FOR ELs AND THEIR FAMILIES (CONTINUED)",null,null,null,null,null,null,null,null,null,null,null,null,null,null,null,"E.  PROGRAMS AND SERVICES FOR ELs AND THEIR FAMILIES (CONTINUED)",null,null,null,null,null,null,null,null,null,null,null,null,null,null,null,"E.  PROGRAMS AND SERVICES FOR ELs AND THEIR FAMILIES (CONTINUED)",null,null,null,null,null,null,null,null,null,null,null,null,null,null,null,"E.  PROGRAMS AND SERVICES FOR ELs AND THEIR FAMILIES (CONTINUED)",null,null,null,null,null,null,null,null,null,null,null,null,null,null,null,"E.  PROGRAMS AND SERVICES FOR ELs AND THEIR FAMILIES (CONTINUED)",null,null,null,null,null,null,null,null,null,null,null,null,null,null,null,"E.  PROGRAMS AND SERVICES FOR ELs AND THEIR FAMILIES (CONTINUED)",null,null,null,null,null,null,null,null,null,null,null,null,null,null,null,"E.  PROGRAMS AND SERVICES FOR ELs AND THEIR FAMILIES (CONTINUED)",null,null,null,null,null,null,null,null,null,null,null,null,null,null,null,"E.  PROGRAMS AND SERVICES FOR ELs AND THEIR FAMILIES (CONTINUED)",null,null,null,null,null,null,null,null,null,null,null,null,null,null,null,"E.  PROGRAMS AND SERVICES FOR ELs AND THEIR FAMILIES (CONTINUED)",null,null,null,null,null,null,null,null,null,null,null,null,null,null,null,"E.  PROGRAMS AND SERVICES FOR ELs AND THEIR FAMILIES (CONTINUED)",null,null,null,null,null,null,null,null,null,null,null,null,null,null,null,"E.  PROGRAMS AND SERVICES FOR ELs AND THEIR FAMILIES (CONTINUED)",null,null,null,null,null,null,null,null,null,null,null,null,null,null,null,"E.  PROGRAMS AND SERVICES FOR ELs AND THEIR FAMILIES (CONTINUED)",null,null,null,null,null,null,null,null,null,null,null,null,null,null,null,"E.  PROGRAMS AND SERVICES FOR ELs AND THEIR FAMILIES (CONTINUED)",null,null,null,null,null,null,null,null,null,null,null,null,null,null,null,"E.  PROGRAMS AND SERVICES FOR ELs AND THEIR FAMILIES (CONTINUED)",null,null,null,null,null,null,null,null,null,null,null,null,null,null,null,"E.  PROGRAMS AND SERVICES FOR ELs AND THEIR FAMILIES (CONTINUED)",null,null,null,null,null,null,null,null,null,null,null,null,null,null,null,"E.  PROGRAMS AND SERVICES FOR ELs AND THEIR FAMILIES (CONTINUED)",null,null,null,null,null,null,null,null,null,null,null,null,null,null,null,"E.  PROGRAMS AND SERVICES FOR ELs AND THEIR FAMILIES (CONTINUED)",null,null,null,null,null,null,null,null,null,null,null,null,null,null,null,"E.  PROGRAMS AND SERVICES FOR ELs AND THEIR FAMILIES (CONTINUED)",null,null,null,null,null,null,null,null,null,null,null,null,null,null,null,"E.  PROGRAMS AND SERVICES FOR ELs AND THEIR FAMILIES (CONTINUED)",null,null,null,null,null,null,null,null,null,null,null,null,null,null,null,"E.  PROGRAMS AND SERVICES FOR ELs AND THEIR FAMILIES (CONTINUED)",null,null,null,null,null,null,null,null,null,null,null,null,null,null,null,"E.  PROGRAMS AND SERVICES FOR ELs AND THEIR FAMILIES (CONTINUED)",null,null,null,null,null,null,null,null,null,null,null,null,null,null,null,"E.  PROGRAMS AND SERVICES FOR ELs AND THEIR FAMILIES (CONTINUED)",null,null,null,null,null,null,null,null,null,null,null,null,null,null,null,"E.  PROGRAMS AND SERVICES FOR ELs AND THEIR FAMILIES (CONTINUED)",null,null,null,null,null,null,null,null,null,null,null,null,null,null,null,"E.  PROGRAMS AND SERVICES FOR ELs AND THEIR FAMILIES (CONTINUED)",null,null,null,null,null,null,null,null,null,null,null,null,null,null,null,"E.  PROGRAMS AND SERVICES FOR ELs AND THEIR FAMILIES (CONTINUED)",null,null,null,null,null,null,null,null,null,null,null,null,null,null,null,"E.  PROGRAMS AND SERVICES FOR ELs AND THEIR FAMILIES (CONTINUED)",null,null,null,null,null,null,null,null,null,null,null,null,null,null,null,"E.  PROGRAMS AND SERVICES FOR ELs AND THEIR FAMILIES (CONTINUED)",null,null,null,null,null,null,null,null,null,null,null,null,null,null,null,"E.  PROGRAMS AND SERVICES FOR ELs AND THEIR FAMILIES (CONTINUED)",null,null,null,null,null,null,null,null,null,null,null,null,null,null,null,"E.  PROGRAMS AND SERVICES FOR ELs AND THEIR FAMILIES (CONTINUED)",null,null,null,null,null,null,null,null,null,null,null,null,null,null,null,"E.  PROGRAMS AND SERVICES FOR ELs AND THEIR FAMILIES (CONTINUED)",null,null,null,null,null,null,null,null,null,null,null,null,null,null,null,"E.  PROGRAMS AND SERVICES FOR ELs AND THEIR FAMILIES (CONTINUED)",null,null,null,null,null,null,null,null,null,null,null,null,null,null,null,"E.  PROGRAMS AND SERVICES FOR ELs AND THEIR FAMILIES (CONTINUED)",null,null,null,null,null,null,null,null,null,null,null,null,null,null,null,"E.  PROGRAMS AND SERVICES FOR ELs AND THEIR FAMILIES (CONTINUED)",null,null,null,null,null,null,null,null,null,null,null,null,null,null,null,"E.  PROGRAMS AND SERVICES FOR ELs AND THEIR FAMILIES (CONTINUED)",null,null,null,null,null,null,null,null,null,null,null,null,null,null,null,"E.  PROGRAMS AND SERVICES FOR ELs AND THEIR FAMILIES (CONTINUED)",null,null,null,null,null,null,null,null,null,null,null,null,null,null,null,"E.  PROGRAMS AND SERVICES FOR ELs AND THEIR FAMILIES (CONTINUED)",null,null,null,null,null,null,null,null,null,null,null,null,null,null,null,"E.  PROGRAMS AND SERVICES FOR ELs AND THEIR FAMILIES (CONTINUED)",null,null,null,null,null,null,null,null,null,null,null,null,null,null,null,"E.  PROGRAMS AND SERVICES FOR ELs AND THEIR FAMILIES (CONTINUED)",null,null,null,null,null,null,null,null,null,null,null,null,null,null,null,"E.  PROGRAMS AND SERVICES FOR ELs AND THEIR FAMILIES (CONTINUED)",null,null,null,null,null,null,null,null,null,null,null,null,null,null,null,"E.  PROGRAMS AND SERVICES FOR ELs AND THEIR FAMILIES (CONTINUED)",null,null,null,null,null,null,null,null,null,null,null,null,null,null,null,"E.  PROGRAMS AND SERVICES FOR ELs AND THEIR FAMILIES (CONTINUED)",null,null,null,null,null,null,null,null,null,null,null,null,null,null,null,"E.  PROGRAMS AND SERVICES FOR ELs AND THEIR FAMILIES (CONTINUED)",null,null,null,null,null,null,null,null,null,null,null,null,null,null,null,"E.  PROGRAMS AND SERVICES FOR ELs AND THEIR FAMILIES (CONTINUED)",null,null,null,null,null,null,null,null,null,null,null,null,null,null,null,"E.  PROGRAMS AND SERVICES FOR ELs AND THEIR FAMILIES (CONTINUED)",null,null,null,null,null,null,null,null,null,null,null,null,null,null,null,"E.  PROGRAMS AND SERVICES FOR ELs AND THEIR FAMILIES (CONTINUED)",null,null,null,null,null,null,null,null,null,null,null,null,null,null,null,"E.  PROGRAMS AND SERVICES FOR ELs AND THEIR FAMILIES (CONTINUED)",null,null,null,null,null,null,null,null,null,null,null,null,null,null,null,"E.  PROGRAMS AND SERVICES FOR ELs AND THEIR FAMILIES (CONTINUED)",null,null,null,null,null,null,null,null,null,null,null,null,null,null,null,"E.  PROGRAMS AND SERVICES FOR ELs AND THEIR FAMILIES (CONTINUED)",null,null,null,null,null,null,null,null,null,null,null,null,null,null,null,"E.  PROGRAMS AND SERVICES FOR ELs AND THEIR FAMILIES (CONTINUED)",null,null,null,null,null,null,null,null,null,null,null,null,null,null,null,"E.  PROGRAMS AND SERVICES FOR ELs AND THEIR FAMILIES (CONTINUED)",null,null,null,null,null,null,null,null,null,null,null,null,null,null,null,"E.  PROGRAMS AND SERVICES FOR ELs AND THEIR FAMILIES (CONTINUED)",null,null,null,null,null,null,null,null,null,null,null,null,null,null,null,"E.  PROGRAMS AND SERVICES FOR ELs AND THEIR FAMILIES (CONTINUED)",null,null,null,null,null,null,null,null,null,null,null,null,null,null,null,"E.  PROGRAMS AND SERVICES FOR ELs AND THEIR FAMILIES (CONTINUED)",null,null,null,null,null,null,null,null,null,null,null,null,null,null,null,"E.  PROGRAMS AND SERVICES FOR ELs AND THEIR FAMILIES (CONTINUED)",null,null,null,null,null,null,null,null,null,null,null,null,null,null,null,"E.  PROGRAMS AND SERVICES FOR ELs AND THEIR FAMILIES (CONTINUED)",null,null,null,null,null,null,null,null,null,null,null,null,null,null,null,"E.  PROGRAMS AND SERVICES FOR ELs AND THEIR FAMILIES (CONTINUED)",null,null,null,null,null,null,null,null,null,null,null,null,null,null,null,"E.  PROGRAMS AND SERVICES FOR ELs AND THEIR FAMILIES (CONTINUED)",null,null,null,null,null,null,null,null,null,null,null,null,null,null,null,"E.  PROGRAMS AND SERVICES FOR ELs AND THEIR FAMILIES (CONTINUED)",null,null,null,null,null,null,null,null,null,null,null,null,null,null,null,"E.  PROGRAMS AND SERVICES FOR ELs AND THEIR FAMILIES (CONTINUED)",null,null,null,null,null,null,null,null,null,null,null,null,null,null,null,"E.  PROGRAMS AND SERVICES FOR ELs AND THEIR FAMILIES (CONTINUED)",null,null,null,null,null,null,null,null,null,null,null,null,null,null,null,"E.  PROGRAMS AND SERVICES FOR ELs AND THEIR FAMILIES (CONTINUED)",null,null,null,null,null,null,null,null,null,null,null,null,null,null,null,"E.  PROGRAMS AND SERVICES FOR ELs AND THEIR FAMILIES (CONTINUED)",null,null,null,null,null,null,null,null,null,null,null,null,null,null,null,"E.  PROGRAMS AND SERVICES FOR ELs AND THEIR FAMILIES (CONTINUED)",null,null,null,null,null,null,null,null,null,null,null,null,null,null,null,"E.  PROGRAMS AND SERVICES FOR ELs AND THEIR FAMILIES (CONTINUED)",null,null,null,null,null,null,null,null,null,null,null,null,null,null,null,"E.  PROGRAMS AND SERVICES FOR ELs AND THEIR FAMILIES (CONTINUED)",null,null,null,null,null,null,null,null,null,null,null,null,null,null,null,"E.  PROGRAMS AND SERVICES FOR ELs AND THEIR FAMILIES (CONTINUED)",null,null,null,null,null,null,null,null,null,null,null,null,null,null,null,"E.  PROGRAMS AND SERVICES FOR ELs AND THEIR FAMILIES (CONTINUED)",null,null,null,null,null,null,null,null,null,null,null,null,null,null,null,"E.  PROGRAMS AND SERVICES FOR ELs AND THEIR FAMILIES (CONTINUED)",null,null,null,null,null,null,null,null,null,null,null,null,null,null,null,"E.  PROGRAMS AND SERVICES FOR ELs AND THEIR FAMILIES (CONTINUED)",null,null,null,null,null,null,null,null,null,null,null,null,null,null,null,"E.  PROGRAMS AND SERVICES FOR ELs AND THEIR FAMILIES (CONTINUED)",null,null,null,null,null,null,null,null,null,null,null,null,null,null,null,"E.  PROGRAMS AND SERVICES FOR ELs AND THEIR FAMILIES (CONTINUED)",null,null,null,null,null,null,null,null,null,null,null,null,null,null,null,"E.  PROGRAMS AND SERVICES FOR ELs AND THEIR FAMILIES (CONTINUED)",null,null,null,null,null,null,null,null,null,null,null,null,null,null,null,"E.  PROGRAMS AND SERVICES FOR ELs AND THEIR FAMILIES (CONTINUED)",null,null,null,null,null,null,null,null,null,null,null,null,null,null,null,"E.  PROGRAMS AND SERVICES FOR ELs AND THEIR FAMILIES (CONTINUED)",null,null,null,null,null,null,null,null,null,null,null,null,null,null,null,"E.  PROGRAMS AND SERVICES FOR ELs AND THEIR FAMILIES (CONTINUED)",null,null,null,null,null,null,null,null,null,null,null,null,null,null,null,"E.  PROGRAMS AND SERVICES FOR ELs AND THEIR FAMILIES (CONTINUED)",null,null,null,null,null,null,null,null,null,null,null,null,null,null,null,"E.  PROGRAMS AND SERVICES FOR ELs AND THEIR FAMILIES (CONTINUED)",null,null,null,null,null,null,null,null,null,null,null,null,null,null,null,"E.  PROGRAMS AND SERVICES FOR ELs AND THEIR FAMILIES (CONTINUED)",null,null,null,null,null,null,null,null,null,null,null,null,null,null,null,"E.  PROGRAMS AND SERVICES FOR ELs AND THEIR FAMILIES (CONTINUED)",null,null,null,null,null,null,null,null,null,null,null,null,null,null,null,"E.  PROGRAMS AND SERVICES FOR ELs AND THEIR FAMILIES (CONTINUED)",null,null,null,null,null,null,null,null,null,null,null,null,null,null,null,"E.  PROGRAMS AND SERVICES FOR ELs AND THEIR FAMILIES (CONTINUED)",null,null,null,null,null,null,null,null,null,null,null,null,null,null,null,"E.  PROGRAMS AND SERVICES FOR ELs AND THEIR FAMILIES (CONTINUED)",null,null,null,null,null,null,null,null,null,null,null,null,null,null,null,"E.  PROGRAMS AND SERVICES FOR ELs AND THEIR FAMILIES (CONTINUED)",null,null,null,null,null,null,null,null,null,null,null,null,null,null,null,"E.  PROGRAMS AND SERVICES FOR ELs AND THEIR FAMILIES (CONTINUED)",null,null,null,null,null,null,null,null,null,null,null,null,null,null,null,"E.  PROGRAMS AND SERVICES FOR ELs AND THEIR FAMILIES (CONTINUED)",null,null,null,null,null,null,null,null,null,null,null,null,null,null,null,"E.  PROGRAMS AND SERVICES FOR ELs AND THEIR FAMILIES (CONTINUED)",null,null,null,null,null,null,null,null,null,null,null,null,null,null,null,"E.  PROGRAMS AND SERVICES FOR ELs AND THEIR FAMILIES (CONTINUED)",null,null,null,null,null,null,null,null,null,null,null,null,null,null,null,"E.  PROGRAMS AND SERVICES FOR ELs AND THEIR FAMILIES (CONTINUED)",null,null,null,null,null,null,null,null,null,null,null,null,null,null,null,"E.  PROGRAMS AND SERVICES FOR ELs AND THEIR FAMILIES (CONTINUED)",null,null,null,null,null,null,null,null,null,null,null,null,null,null,null,"E.  PROGRAMS AND SERVICES FOR ELs AND THEIR FAMILIES (CONTINUED)",null,null,null,null,null,null,null,null,null,null,null,null,null,null,null,"E.  PROGRAMS AND SERVICES FOR ELs AND THEIR FAMILIES (CONTINUED)",null,null,null,null,null,null,null,null,null,null,null,null,null,null,null,"E.  PROGRAMS AND SERVICES FOR ELs AND THEIR FAMILIES (CONTINUED)",null,null,null,null,null,null,null,null,null,null,null,null,null,null,null,"E.  PROGRAMS AND SERVICES FOR ELs AND THEIR FAMILIES (CONTINUED)",null,null,null,null,null,null,null,null,null,null,null,null,null,null,null,"E.  PROGRAMS AND SERVICES FOR ELs AND THEIR FAMILIES (CONTINUED)",null,null,null,null,null,null,null,null,null,null,null,null,null,null,null,"E.  PROGRAMS AND SERVICES FOR ELs AND THEIR FAMILIES (CONTINUED)",null,null,null,null,null,null,null,null,null,null,null,null,null,null,null,"E.  PROGRAMS AND SERVICES FOR ELs AND THEIR FAMILIES (CONTINUED)",null,null,null,null,null,null,null,null,null,null,null,null,null,null,null,"E.  PROGRAMS AND SERVICES FOR ELs AND THEIR FAMILIES (CONTINUED)",null,null,null,null,null,null,null,null,null,null,null,null,null,null,null,"E.  PROGRAMS AND SERVICES FOR ELs AND THEIR FAMILIES (CONTINUED)",null,null,null,null,null,null,null,null,null,null,null,null,null,null,null,"E.  PROGRAMS AND SERVICES FOR ELs AND THEIR FAMILIES (CONTINUED)",null,null,null,null,null,null,null,null,null,null,null,null,null,null,null,"E.  PROGRAMS AND SERVICES FOR ELs AND THEIR FAMILIES (CONTINUED)",null,null,null,null,null,null,null,null,null,null,null,null,null,null,null,"E.  PROGRAMS AND SERVICES FOR ELs AND THEIR FAMILIES (CONTINUED)",null,null,null,null,null,null,null,null,null,null,null,null,null,null,null,"E.  PROGRAMS AND SERVICES FOR ELs AND THEIR FAMILIES (CONTINUED)",null,null,null,null,null,null,null,null,null,null,null,null,null,null,null,"E.  PROGRAMS AND SERVICES FOR ELs AND THEIR FAMILIES (CONTINUED)",null,null,null,null,null,null,null,null,null,null,null,null,null,null,null,"E.  PROGRAMS AND SERVICES FOR ELs AND THEIR FAMILIES (CONTINUED)",null,null,null,null,null,null,null,null,null,null,null,null,null,null,null,"E.  PROGRAMS AND SERVICES FOR ELs AND THEIR FAMILIES (CONTINUED)",null,null,null,null,null,null,null,null,null,null,null,null,null,null,null,"E.  PROGRAMS AND SERVICES FOR ELs AND THEIR FAMILIES (CONTINUED)",null,null,null,null,null,null,null,null,null,null,null,null,null,null,null,"E.  PROGRAMS AND SERVICES FOR ELs AND THEIR FAMILIES (CONTINUED)",null,null,null,null,null,null,null,null,null,null,null,null,null,null,null,"E.  PROGRAMS AND SERVICES FOR ELs AND THEIR FAMILIES (CONTINUED)",null,null,null,null,null,null,null,null,null,null,null,null,null,null,null,"E.  PROGRAMS AND SERVICES FOR ELs AND THEIR FAMILIES (CONTINUED)",null,null,null,null,null,null,null,null,null,null,null,null,null,null,null,"E.  PROGRAMS AND SERVICES FOR ELs AND THEIR FAMILIES (CONTINUED)",null,null,null,null,null,null,null,null,null,null,null,null,null,null,null,"E.  PROGRAMS AND SERVICES FOR ELs AND THEIR FAMILIES (CONTINUED)",null,null,null,null,null,null,null,null,null,null,null,null,null,null,null,"E.  PROGRAMS AND SERVICES FOR ELs AND THEIR FAMILIES (CONTINUED)",null,null,null,null,null,null,null,null,null,null,null,null,null,null,null,"E.  PROGRAMS AND SERVICES FOR ELs AND THEIR FAMILIES (CONTINUED)",null,null,null,null,null,null,null,null,null,null,null,null,null,null,null,"E.  PROGRAMS AND SERVICES FOR ELs AND THEIR FAMILIES (CONTINUED)",null,null,null,null,null,null,null,null,null,null,null,null,null,null,null,"E.  PROGRAMS AND SERVICES FOR ELs AND THEIR FAMILIES (CONTINUED)",null,null,null,null,null,null,null,null,null,null,null,null,null,null,null,"E.  PROGRAMS AND SERVICES FOR ELs AND THEIR FAMILIES (CONTINUED)",null,null,null,null,null,null,null,null,null,null,null,null,null,null,null,"E.  PROGRAMS AND SERVICES FOR ELs AND THEIR FAMILIES (CONTINUED)",null,null,null,null,null,null,null,null,null,null,null,null,null,null,null,"E.  PROGRAMS AND SERVICES FOR ELs AND THEIR FAMILIES (CONTINUED)",null,null,null,null,null,null,null,null,null,null,null,null,null,null,null,"E.  PROGRAMS AND SERVICES FOR ELs AND THEIR FAMILIES (CONTINUED)",null,null,null,null,null,null,null,null,null,null,null,null,null,null,null,"E.  PROGRAMS AND SERVICES FOR ELs AND THEIR FAMILIES (CONTINUED)",null,null,null,null,null,null,null,null,null,null,null,null,null,null,null,"E.  PROGRAMS AND SERVICES FOR ELs AND THEIR FAMILIES (CONTINUED)",null,null,null,null,null,null,null,null,null,null,null,null,null,null,null,"E.  PROGRAMS AND SERVICES FOR ELs AND THEIR FAMILIES (CONTINUED)",null,null,null,null,null,null,null,null,null,null,null,null,null,null,null,"E.  PROGRAMS AND SERVICES FOR ELs AND THEIR FAMILIES (CONTINUED)",null,null,null,null,null,null,null,null,null,null,null,null,null,null,null,"E.  PROGRAMS AND SERVICES FOR ELs AND THEIR FAMILIES (CONTINUED)",null,null,null,null,null,null,null,null,null,null,null,null,null,null,null,"E.  PROGRAMS AND SERVICES FOR ELs AND THEIR FAMILIES (CONTINUED)",null,null,null,null,null,null,null,null,null,null,null,null,null,null,null,"E.  PROGRAMS AND SERVICES FOR ELs AND THEIR FAMILIES (CONTINUED)",null,null,null,null,null,null,null,null,null,null,null,null,null,null,null,"E.  PROGRAMS AND SERVICES FOR ELs AND THEIR FAMILIES (CONTINUED)",null,null,null,null,null,null,null,null,null,null,null,null,null,null,null,"E.  PROGRAMS AND SERVICES FOR ELs AND THEIR FAMILIES (CONTINUED)",null,null,null,null,null,null,null,null,null,null,null,null,null,null,null,"E.  PROGRAMS AND SERVICES FOR ELs AND THEIR FAMILIES (CONTINUED)",null,null,null,null,null,null,null,null,null,null,null,null,null,null,null,"E.  PROGRAMS AND SERVICES FOR ELs AND THEIR FAMILIES (CONTINUED)",null,null,null,null,null,null,null,null,null,null,null,null,null,null,null,"E.  PROGRAMS AND SERVICES FOR ELs AND THEIR FAMILIES (CONTINUED)",null,null,null,null,null,null,null,null,null,null,null,null,null,null,null,"E.  PROGRAMS AND SERVICES FOR ELs AND THEIR FAMILIES (CONTINUED)",null,null,null,null,null,null,null,null,null,null,null,null,null,null,null,"E.  PROGRAMS AND SERVICES FOR ELs AND THEIR FAMILIES (CONTINUED)",null,null,null,null,null,null,null,null,null,null,null,null,null,null,null,"E.  PROGRAMS AND SERVICES FOR ELs AND THEIR FAMILIES (CONTINUED)",null,null,null,null,null,null,null,null,null,null,null,null,null,null,null,"E.  PROGRAMS AND SERVICES FOR ELs AND THEIR FAMILIES (CONTINUED)",null,null,null,null,null,null,null,null,null,null,null,null,null,null,null,"E.  PROGRAMS AND SERVICES FOR ELs AND THEIR FAMILIES (CONTINUED)",null,null,null,null,null,null,null,null,null,null,null,null,null,null,null,"E.  PROGRAMS AND SERVICES FOR ELs AND THEIR FAMILIES (CONTINUED)",null,null,null,null,null,null,null,null,null,null,null,null,null,null,null,"E.  PROGRAMS AND SERVICES FOR ELs AND THEIR FAMILIES (CONTINUED)",null,null,null,null,null,null,null,null,null,null,null,null,null,null,null,"E.  PROGRAMS AND SERVICES FOR ELs AND THEIR FAMILIES (CONTINUED)",null,null,null,null,null,null,null,null,null,null,null,null,null,null,null,"E.  PROGRAMS AND SERVICES FOR ELs AND THEIR FAMILIES (CONTINUED)",null,null,null,null,null,null,null,null,null,null,null,null,null,null,null,"E.  PROGRAMS AND SERVICES FOR ELs AND THEIR FAMILIES (CONTINUED)",null,null,null,null,null,null,null,null,null,null,null,null,null,null,null,"E.  PROGRAMS AND SERVICES FOR ELs AND THEIR FAMILIES (CONTINUED)",null,null,null,null,null,null,null,null,null,null,null,null,null,null,null,"E.  PROGRAMS AND SERVICES FOR ELs AND THEIR FAMILIES (CONTINUED)",null,null,null,null,null,null,null,null,null,null,null,null,null,null,null,"E.  PROGRAMS AND SERVICES FOR ELs AND THEIR FAMILIES (CONTINUED)",null,null,null,null,null,null,null,null,null,null,null,null,null,null,null,"E.  PROGRAMS AND SERVICES FOR ELs AND THEIR FAMILIES (CONTINUED)",null,null,null,null,null,null,null,null,null,null,null,null,null,null,null,"E.  PROGRAMS AND SERVICES FOR ELs AND THEIR FAMILIES (CONTINUED)",null,null,null,null,null,null,null,null,null,null,null,null,null,null,null,"E.  PROGRAMS AND SERVICES FOR ELs AND THEIR FAMILIES (CONTINUED)",null,null,null,null,null,null,null,null,null,null,null,null,null,null,null,"E.  PROGRAMS AND SERVICES FOR ELs AND THEIR FAMILIES (CONTINUED)",null,null,null,null,null,null,null,null,null,null,null,null,null,null,null,"E.  PROGRAMS AND SERVICES FOR ELs AND THEIR FAMILIES (CONTINUED)",null,null,null,null,null,null,null,null,null,null,null,null,null,null,null,"E.  PROGRAMS AND SERVICES FOR ELs AND THEIR FAMILIES (CONTINUED)",null,null,null,null,null,null,null,null,null,null,null,null,null,null,null,"E.  PROGRAMS AND SERVICES FOR ELs AND THEIR FAMILIES (CONTINUED)",null,null,null,null,null,null,null,null,null,null,null,null,null,null,null,"E.  PROGRAMS AND SERVICES FOR ELs AND THEIR FAMILIES (CONTINUED)",null,null,null,null,null,null,null,null,null,null,null,null,null,null,null,"E.  PROGRAMS AND SERVICES FOR ELs AND THEIR FAMILIES (CONTINUED)",null,null,null,null,null,null,null,null,null,null,null,null,null,null,null,"E.  PROGRAMS AND SERVICES FOR ELs AND THEIR FAMILIES (CONTINUED)",null,null,null,null,null,null,null,null,null,null,null,null,null,null,null,"E.  PROGRAMS AND SERVICES FOR ELs AND THEIR FAMILIES (CONTINUED)",null,null,null,null,null,null,null,null,null,null,null,null,null,null,null,"E.  PROGRAMS AND SERVICES FOR ELs AND THEIR FAMILIES (CONTINUED)",null,null,null,null,null,null,null,null,null,null,null,null,null,null,null,"E.  PROGRAMS AND SERVICES FOR ELs AND THEIR FAMILIES (CONTINUED)",null,null,null,null,null,null,null,null,null,null,null,null,null,null,null,"E.  PROGRAMS AND SERVICES FOR ELs AND THEIR FAMILIES (CONTINUED)",null,null,null,null,null,null,null,null,null,null,null,null,null,null,null,"E.  PROGRAMS AND SERVICES FOR ELs AND THEIR FAMILIES (CONTINUED)",null,null,null,null,null,null,null,null,null,null,null,null,null,null,null,"E.  PROGRAMS AND SERVICES FOR ELs AND THEIR FAMILIES (CONTINUED)",null,null,null,null,null,null,null,null,null,null,null,null,null,null,null,"E.  PROGRAMS AND SERVICES FOR ELs AND THEIR FAMILIES (CONTINUED)",null,null,null,null,null,null,null,null,null,null,null,null,null,null,null,"E.  PROGRAMS AND SERVICES FOR ELs AND THEIR FAMILIES (CONTINUED)",null,null,null,null,null,null,null,null,null,null,null,null,null,null,null,"E.  PROGRAMS AND SERVICES FOR ELs AND THEIR FAMILIES (CONTINUED)",null,null,null,null,null,null,null,null,null,null,null,null,null,null,null,"E.  PROGRAMS AND SERVICES FOR ELs AND THEIR FAMILIES (CONTINUED)",null,null,null,null,null,null,null,null,null,null,null,null,null,null,null,"E.  PROGRAMS AND SERVICES FOR ELs AND THEIR FAMILIES (CONTINUED)",null,null,null,null,null,null,null,null,null,null,null,null,null,null,null,"E.  PROGRAMS AND SERVICES FOR ELs AND THEIR FAMILIES (CONTINUED)",null,null,null,null,null,null,null,null,null,null,null,null,null,null,null,"E.  PROGRAMS AND SERVICES FOR ELs AND THEIR FAMILIES (CONTINUED)",null,null,null,null,null,null,null,null,null,null,null,null,null,null,null,"E.  PROGRAMS AND SERVICES FOR ELs AND THEIR FAMILIES (CONTINUED)",null,null,null,null,null,null,null,null,null,null,null,null,null,null,null,"E.  PROGRAMS AND SERVICES FOR ELs AND THEIR FAMILIES (CONTINUED)",null,null,null,null,null,null,null,null,null,null,null,null,null,null,null,"E.  PROGRAMS AND SERVICES FOR ELs AND THEIR FAMILIES (CONTINUED)",null,null,null,null,null,null,null,null,null,null,null,null,null,null,null,"E.  PROGRAMS AND SERVICES FOR ELs AND THEIR FAMILIES (CONTINUED)",null,null,null,null,null,null,null,null,null,null,null,null,null,null,null,"E.  PROGRAMS AND SERVICES FOR ELs AND THEIR FAMILIES (CONTINUED)",null,null,null,null,null,null,null,null,null,null,null,null,null,null,null,"E.  PROGRAMS AND SERVICES FOR ELs AND THEIR FAMILIES (CONTINUED)",null,null,null,null,null,null,null,null,null,null,null,null,null,null,null,"E.  PROGRAMS AND SERVICES FOR ELs AND THEIR FAMILIES (CONTINUED)",null,null,null,null,null,null,null,null,null,null,null,null,null,null,null,"E.  PROGRAMS AND SERVICES FOR ELs AND THEIR FAMILIES (CONTINUED)",null,null,null,null,null,null,null,null,null,null,null,null,null,null,null,"E.  PROGRAMS AND SERVICES FOR ELs AND THEIR FAMILIES (CONTINUED)",null,null,null,null,null,null,null,null,null,null,null,null,null,null,null,"E.  PROGRAMS AND SERVICES FOR ELs AND THEIR FAMILIES (CONTINUED)",null,null,null,null,null,null,null,null,null,null,null,null,null,null,null,"E.  PROGRAMS AND SERVICES FOR ELs AND THEIR FAMILIES (CONTINUED)",null,null,null,null,null,null,null,null,null,null,null,null,null,null,null,"E.  PROGRAMS AND SERVICES FOR ELs AND THEIR FAMILIES (CONTINUED)",null,null,null,null,null,null,null,null,null,null,null,null,null,null,null,"E.  PROGRAMS AND SERVICES FOR ELs AND THEIR FAMILIES (CONTINUED)",null,null,null,null,null,null,null,null,null,null,null,null,null,null,null,"E.  PROGRAMS AND SERVICES FOR ELs AND THEIR FAMILIES (CONTINUED)",null,null,null,null,null,null,null,null,null,null,null,null,null,null,null,"E.  PROGRAMS AND SERVICES FOR ELs AND THEIR FAMILIES (CONTINUED)",null,null,null,null,null,null,null,null,null,null,null,null,null,null,null,"E.  PROGRAMS AND SERVICES FOR ELs AND THEIR FAMILIES (CONTINUED)",null,null,null,null,null,null,null,null,null,null,null,null,null,null,null,"E.  PROGRAMS AND SERVICES FOR ELs AND THEIR FAMILIES (CONTINUED)",null,null,null,null,null,null,null,null,null,null,null,null,null,null,null,"E.  PROGRAMS AND SERVICES FOR ELs AND THEIR FAMILIES (CONTINUED)",null,null,null,null,null,null,null,null,null,null,null,null,null,null,null,"E.  PROGRAMS AND SERVICES FOR ELs AND THEIR FAMILIES (CONTINUED)",null,null,null,null,null,null,null,null,null,null,null,null,null,null,null,"E.  PROGRAMS AND SERVICES FOR ELs AND THEIR FAMILIES (CONTINUED)",null,null,null,null,null,null,null,null,null,null,null,null,null,null,null,"E.  PROGRAMS AND SERVICES FOR ELs AND THEIR FAMILIES (CONTINUED)",null,null,null,null,null,null,null,null,null,null,null,null,null,null,null,"E.  PROGRAMS AND SERVICES FOR ELs AND THEIR FAMILIES (CONTINUED)",null,null,null,null,null,null,null,null,null,null,null,null,null,null,null,"E.  PROGRAMS AND SERVICES FOR ELs AND THEIR FAMILIES (CONTINUED)",null,null,null,null,null,null,null,null,null,null,null,null,null,null,null,"E.  PROGRAMS AND SERVICES FOR ELs AND THEIR FAMILIES (CONTINUED)",null,null,null,null,null,null,null,null,null,null,null,null,null,null,null,"E.  PROGRAMS AND SERVICES FOR ELs AND THEIR FAMILIES (CONTINUED)",null,null,null,null,null,null,null,null,null,null,null,null,null,null,null,"E.  PROGRAMS AND SERVICES FOR ELs AND THEIR FAMILIES (CONTINUED)",null,null,null,null,null,null,null,null,null,null,null,null,null,null,null,"E.  PROGRAMS AND SERVICES FOR ELs AND THEIR FAMILIES (CONTINUED)",null,null,null,null,null,null,null,null,null,null,null,null,null,null,null,"E.  PROGRAMS AND SERVICES FOR ELs AND THEIR FAMILIES (CONTINUED)",null,null,null,null,null,null,null,null,null,null,null,null,null,null,null,"E.  PROGRAMS AND SERVICES FOR ELs AND THEIR FAMILIES (CONTINUED)",null,null,null,null,null,null,null,null,null,null,null,null,null,null,null,"E.  PROGRAMS AND SERVICES FOR ELs AND THEIR FAMILIES (CONTINUED)",null,null,null,null,null,null,null,null,null,null,null,null,null,null,null,"E.  PROGRAMS AND SERVICES FOR ELs AND THEIR FAMILIES (CONTINUED)",null,null,null,null,null,null,null,null,null,null,null,null,null,null,null,"E.  PROGRAMS AND SERVICES FOR ELs AND THEIR FAMILIES (CONTINUED)",null,null,null,null,null,null,null,null,null,null,null,null,null,null,null,"E.  PROGRAMS AND SERVICES FOR ELs AND THEIR FAMILIES (CONTINUED)",null,null,null,null,null,null,null,null,null,null,null,null,null,null,null,"E.  PROGRAMS AND SERVICES FOR ELs AND THEIR FAMILIES (CONTINUED)",null,null,null,null,null,null,null,null,null,null,null,null,null,null,null,"E.  PROGRAMS AND SERVICES FOR ELs AND THEIR FAMILIES (CONTINUED)",null,null,null,null,null,null,null,null,null,null,null,null,null,null,null,"E.  PROGRAMS AND SERVICES FOR ELs AND THEIR FAMILIES (CONTINUED)",null,null,null,null,null,null,null,null,null,null,null,null,null,null,null,"E.  PROGRAMS AND SERVICES FOR ELs AND THEIR FAMILIES (CONTINUED)",null,null,null,null,null,null,null,null,null,null,null,null,null,null,null,"E.  PROGRAMS AND SERVICES FOR ELs AND THEIR FAMILIES (CONTINUED)",null,null,null,null,null,null,null,null,null,null,null,null,null,null,null,"E.  PROGRAMS AND SERVICES FOR ELs AND THEIR FAMILIES (CONTINUED)",null,null,null,null,null,null,null,null,null,null,null,null,null,null,null,"E.  PROGRAMS AND SERVICES FOR ELs AND THEIR FAMILIES (CONTINUED)",null,null,null,null,null,null,null,null,null,null,null,null,null,null,null,"E.  PROGRAMS AND SERVICES FOR ELs AND THEIR FAMILIES (CONTINUED)",null,null,null,null,null,null,null,null,null,null,null,null,null,null,null,"E.  PROGRAMS AND SERVICES FOR ELs AND THEIR FAMILIES (CONTINUED)",null,null,null,null,null,null,null,null,null,null,null,null,null,null,null,"E.  PROGRAMS AND SERVICES FOR ELs AND THEIR FAMILIES (CONTINUED)",null,null,null,null,null,null,null,null,null,null,null,null,null,null,null,"E.  PROGRAMS AND SERVICES FOR ELs AND THEIR FAMILIES (CONTINUED)",null,null,null,null,null,null,null,null,null,null,null,null,null,null,null,"E.  PROGRAMS AND SERVICES FOR ELs AND THEIR FAMILIES (CONTINUED)",null,null,null,null,null,null,null,null,null,null,null,null,null,null,null,"E.  PROGRAMS AND SERVICES FOR ELs AND THEIR FAMILIES (CONTINUED)",null,null,null,null,null,null,null,null,null,null,null,null,null,null,null,"E.  PROGRAMS AND SERVICES FOR ELs AND THEIR FAMILIES (CONTINUED)",null,null,null,null,null,null,null,null,null,null,null,null,null,null,null,"E.  PROGRAMS AND SERVICES FOR ELs AND THEIR FAMILIES (CONTINUED)",null,null,null,null,null,null,null,null,null,null,null,null,null,null,null,"E.  PROGRAMS AND SERVICES FOR ELs AND THEIR FAMILIES (CONTINUED)",null,null,null,null,null,null,null,null,null,null,null,null,null,null,null,"E.  PROGRAMS AND SERVICES FOR ELs AND THEIR FAMILIES (CONTINUED)",null,null,null,null,null,null,null,null,null,null,null,null,null,null,null,"E.  PROGRAMS AND SERVICES FOR ELs AND THEIR FAMILIES (CONTINUED)",null,null,null,null,null,null,null,null,null,null,null,null,null,null,null,"E.  PROGRAMS AND SERVICES FOR ELs AND THEIR FAMILIES (CONTINUED)",null,null,null,null,null,null,null,null,null,null,null,null,null,null,null,"E.  PROGRAMS AND SERVICES FOR ELs AND THEIR FAMILIES (CONTINUED)",null,null,null,null,null,null,null,null,null,null,null,null,null,null,null,"E.  PROGRAMS AND SERVICES FOR ELs AND THEIR FAMILIES (CONTINUED)",null,null,null,null,null,null,null,null,null,null,null,null,null,null,null,"E.  PROGRAMS AND SERVICES FOR ELs AND THEIR FAMILIES (CONTINUED)",null,null,null,null,null,null,null,null,null,null,null,null,null,null,null,"E.  PROGRAMS AND SERVICES FOR ELs AND THEIR FAMILIES (CONTINUED)",null,null,null,null,null,null,null,null,null,null,null,null,null,null,null,"E.  PROGRAMS AND SERVICES FOR ELs AND THEIR FAMILIES (CONTINUED)",null,null,null,null,null,null,null,null,null,null,null,null,null,null,null,"E.  PROGRAMS AND SERVICES FOR ELs AND THEIR FAMILIES (CONTINUED)",null,null,null,null,null,null,null,null,null,null,null,null,null,null,null,"E.  PROGRAMS AND SERVICES FOR ELs AND THEIR FAMILIES (CONTINUED)",null,null,null,null,null,null,null,null,null,null,null,null,null,null,null,"E.  PROGRAMS AND SERVICES FOR ELs AND THEIR FAMILIES (CONTINUED)",null,null,null,null,null,null,null,null,null,null,null,null,null,null,null,"E.  PROGRAMS AND SERVICES FOR ELs AND THEIR FAMILIES (CONTINUED)",null,null,null,null,null,null,null,null,null,null,null,null,null,null,null,"E.  PROGRAMS AND SERVICES FOR ELs AND THEIR FAMILIES (CONTINUED)",null,null,null,null,null,null,null,null,null,null,null,null,null,null,null,"E.  PROGRAMS AND SERVICES FOR ELs AND THEIR FAMILIES (CONTINUED)",null,null,null,null,null,null,null,null,null,null,null,null,null,null,null,"E.  PROGRAMS AND SERVICES FOR ELs AND THEIR FAMILIES (CONTINUED)",null,null,null,null,null,null,null,null,null,null,null,null,null,null,null,"E.  PROGRAMS AND SERVICES FOR ELs AND THEIR FAMILIES (CONTINUED)",null,null,null,null,null,null,null,null,null,null,null,null,null,null,null,"E.  PROGRAMS AND SERVICES FOR ELs AND THEIR FAMILIES (CONTINUED)",null,null,null,null,null,null,null,null,null,null,null,null,null,null,null,"E.  PROGRAMS AND SERVICES FOR ELs AND THEIR FAMILIES (CONTINUED)",null,null,null,null,null,null,null,null,null,null,null,null,null,null,null,"E.  PROGRAMS AND SERVICES FOR ELs AND THEIR FAMILIES (CONTINUED)",null,null,null,null,null,null,null,null,null,null,null,null,null,null,null,"E.  PROGRAMS AND SERVICES FOR ELs AND THEIR FAMILIES (CONTINUED)",null,null,null,null,null,null,null,null,null,null,null,null,null,null,null,"E.  PROGRAMS AND SERVICES FOR ELs AND THEIR FAMILIES (CONTINUED)",null,null,null,null,null,null,null,null,null,null,null,null,null,null,null,"E.  PROGRAMS AND SERVICES FOR ELs AND THEIR FAMILIES (CONTINUED)",null,null,null,null,null,null,null,null,null,null,null,null,null,null,null,"E.  PROGRAMS AND SERVICES FOR ELs AND THEIR FAMILIES (CONTINUED)",null,null,null,null,null,null,null,null,null,null,null,null,null,null,null,"E.  PROGRAMS AND SERVICES FOR ELs AND THEIR FAMILIES (CONTINUED)",null,null,null,null,null,null,null,null,null,null,null,null,null,null,null,"E.  PROGRAMS AND SERVICES FOR ELs AND THEIR FAMILIES (CONTINUED)",null,null,null,null,null,null,null,null,null,null,null,null,null,null,null,"E.  PROGRAMS AND SERVICES FOR ELs AND THEIR FAMILIES (CONTINUED)",null,null,null,null,null,null,null,null,null,null,null,null,null,null,null,"E.  PROGRAMS AND SERVICES FOR ELs AND THEIR FAMILIES (CONTINUED)",null,null,null,null,null,null,null,null,null,null,null,null,null,null,null,"E.  PROGRAMS AND SERVICES FOR ELs AND THEIR FAMILIES (CONTINUED)",null,null,null,null,null,null,null,null,null,null,null,null,null,null,null,"E.  PROGRAMS AND SERVICES FOR ELs AND THEIR FAMILIES (CONTINUED)",null,null,null,null,null,null,null,null,null,null,null,null,null,null,null,"E.  PROGRAMS AND SERVICES FOR ELs AND THEIR FAMILIES (CONTINUED)",null,null,null,null,null,null,null,null,null,null,null,null,null,null,null,"E.  PROGRAMS AND SERVICES FOR ELs AND THEIR FAMILIES (CONTINUED)",null,null,null,null,null,null,null,null,null,null,null,null,null,null,null,"E.  PROGRAMS AND SERVICES FOR ELs AND THEIR FAMILIES (CONTINUED)",null,null,null,null,null,null,null,null,null,null,null,null,null,null,null,"E.  PROGRAMS AND SERVICES FOR ELs AND THEIR FAMILIES (CONTINUED)",null,null,null,null,null,null,null,null,null,null,null,null,null,null,null,"E.  PROGRAMS AND SERVICES FOR ELs AND THEIR FAMILIES (CONTINUED)",null,null,null,null,null,null,null,null,null,null,null,null,null,null,null,"E.  PROGRAMS AND SERVICES FOR ELs AND THEIR FAMILIES (CONTINUED)",null,null,null,null,null,null,null,null,null,null,null,null,null,null,null,"E.  PROGRAMS AND SERVICES FOR ELs AND THEIR FAMILIES (CONTINUED)",null,null,null,null,null,null,null,null,null,null,null,null,null,null,null,"E.  PROGRAMS AND SERVICES FOR ELs AND THEIR FAMILIES (CONTINUED)",null,null,null,null,null,null,null,null,null,null,null,null,null,null,null,"E.  PROGRAMS AND SERVICES FOR ELs AND THEIR FAMILIES (CONTINUED)",null,null,null,null,null,null,null,null,null,null,null,null,null,null,null,"E.  PROGRAMS AND SERVICES FOR ELs AND THEIR FAMILIES (CONTINUED)",null,null,null,null,null,null,null,null,null,null,null,null,null,null,null,"E.  PROGRAMS AND SERVICES FOR ELs AND THEIR FAMILIES (CONTINUED)",null,null,null,null,null,null,null,null,null,null,null,null,null,null,null,"E.  PROGRAMS AND SERVICES FOR ELs AND THEIR FAMILIES (CONTINUED)",null,null,null,null,null,null,null,null,null,null,null,null,null,null,null,"E.  PROGRAMS AND SERVICES FOR ELs AND THEIR FAMILIES (CONTINUED)",null,null,null,null,null,null,null,null,null,null,null,null,null,null,null,"E.  PROGRAMS AND SERVICES FOR ELs AND THEIR FAMILIES (CONTINUED)",null,null,null,null,null,null,null,null,null,null,null,null,null,null,null,"E.  PROGRAMS AND SERVICES FOR ELs AND THEIR FAMILIES (CONTINUED)",null,null,null,null,null,null,null,null,null,null,null,null,null,null,null,"E.  PROGRAMS AND SERVICES FOR ELs AND THEIR FAMILIES (CONTINUED)",null,null,null,null,null,null,null,null,null,null,null,null,null,null,null,"E.  PROGRAMS AND SERVICES FOR ELs AND THEIR FAMILIES (CONTINUED)",null,null,null,null,null,null,null,null,null,null,null,null,null,null,null,"E.  PROGRAMS AND SERVICES FOR ELs AND THEIR FAMILIES (CONTINUED)",null,null,null,null,null,null,null,null,null,null,null,null,null,null,null,"E.  PROGRAMS AND SERVICES FOR ELs AND THEIR FAMILIES (CONTINUED)",null,null,null,null,null,null,null,null,null,null,null,null,null,null,null,"E.  PROGRAMS AND SERVICES FOR ELs AND THEIR FAMILIES (CONTINUED)",null,null,null,null,null,null,null,null,null,null,null,null,null,null,null,"E.  PROGRAMS AND SERVICES FOR ELs AND THEIR FAMILIES (CONTINUED)",null,null,null,null,null,null,null,null,null,null,null,null,null,null,null,"E.  PROGRAMS AND SERVICES FOR ELs AND THEIR FAMILIES (CONTINUED)",null,null,null,null,null,null,null,null,null,null,null,null,null,null,null,"E.  PROGRAMS AND SERVICES FOR ELs AND THEIR FAMILIES (CONTINUED)",null,null,null,null,null,null,null,null,null,null,null,null,null,null,null,"E.  PROGRAMS AND SERVICES FOR ELs AND THEIR FAMILIES (CONTINUED)",null,null,null,null,null,null,null,null,null,null,null,null,null,null,null,"E.  PROGRAMS AND SERVICES FOR ELs AND THEIR FAMILIES (CONTINUED)",null,null,null,null,null,null,null,null,null,null,null,null,null,null,null,"E.  PROGRAMS AND SERVICES FOR ELs AND THEIR FAMILIES (CONTINUED)",null,null,null,null,null,null,null,null,null,null,null,null,null,null,null,"E.  PROGRAMS AND SERVICES FOR ELs AND THEIR FAMILIES (CONTINUED)",null,null,null,null,null,null,null,null,null,null,null,null,null,null,null,"E.  PROGRAMS AND SERVICES FOR ELs AND THEIR FAMILIES (CONTINUED)",null,null,null,null,null,null,null,null,null,null,null,null,null,null,null,"E.  PROGRAMS AND SERVICES FOR ELs AND THEIR FAMILIES (CONTINUED)",null,null,null,null,null,null,null,null,null,null,null,null,null,null,null,"E.  PROGRAMS AND SERVICES FOR ELs AND THEIR FAMILIES (CONTINUED)",null,null,null,null,null,null,null,null,null,null,null,null,null,null,null,"E.  PROGRAMS AND SERVICES FOR ELs AND THEIR FAMILIES (CONTINUED)",null,null,null,null,null,null,null,null,null,null,null,null,null,null,null,"E.  PROGRAMS AND SERVICES FOR ELs AND THEIR FAMILIES (CONTINUED)",null,null,null,null,null,null,null,null,null,null,null,null,null,null,null,"E.  PROGRAMS AND SERVICES FOR ELs AND THEIR FAMILIES (CONTINUED)",null,null,null,null,null,null,null,null,null,null,null,null,null,null,null,"E.  PROGRAMS AND SERVICES FOR ELs AND THEIR FAMILIES (CONTINUED)",null,null,null,null,null,null,null,null,null,null,null,null,null,null,null,"E.  PROGRAMS AND SERVICES FOR ELs AND THEIR FAMILIES (CONTINUED)",null,null,null,null,null,null,null,null,null,null,null,null,null,null,null,"E.  PROGRAMS AND SERVICES FOR ELs AND THEIR FAMILIES (CONTINUED)",null,null,null,null,null,null,null,null,null,null,null,null,null,null,null,"E.  PROGRAMS AND SERVICES FOR ELs AND THEIR FAMILIES (CONTINUED)",null,null,null,null,null,null,null,null,null,null,null,null,null,null,null,"E.  PROGRAMS AND SERVICES FOR ELs AND THEIR FAMILIES (CONTINUED)",null,null,null,null,null,null,null,null,null,null,null,null,null,null,null,"E.  PROGRAMS AND SERVICES FOR ELs AND THEIR FAMILIES (CONTINUED)",null,null,null,null,null,null,null,null,null,null,null,null,null,null,null,"E.  PROGRAMS AND SERVICES FOR ELs AND THEIR FAMILIES (CONTINUED)",null,null,null,null,null,null,null,null,null,null,null,null,null,null,null,"E.  PROGRAMS AND SERVICES FOR ELs AND THEIR FAMILIES (CONTINUED)",null,null,null,null,null,null,null,null,null,null,null,null,null,null,null,"E.  PROGRAMS AND SERVICES FOR ELs AND THEIR FAMILIES (CONTINUED)",null,null,null,null,null,null,null,null,null,null,null,null,null,null,null,"E.  PROGRAMS AND SERVICES FOR ELs AND THEIR FAMILIES (CONTINUED)",null,null,null,null,null,null,null,null,null,null,null,null,null,null,null,"E.  PROGRAMS AND SERVICES FOR ELs AND THEIR FAMILIES (CONTINUED)",null,null,null,null,null,null,null,null,null,null,null,null,null,null,null,"E.  PROGRAMS AND SERVICES FOR ELs AND THEIR FAMILIES (CONTINUED)",null,null,null,null,null,null,null,null,null,null,null,null,null,null,null,"E.  PROGRAMS AND SERVICES FOR ELs AND THEIR FAMILIES (CONTINUED)",null,null,null,null,null,null,null,null,null,null,null,null,null,null,null,"E.  PROGRAMS AND SERVICES FOR ELs AND THEIR FAMILIES (CONTINUED)",null,null,null,null,null,null,null,null,null,null,null,null,null,null,null,"E.  PROGRAMS AND SERVICES FOR ELs AND THEIR FAMILIES (CONTINUED)",null,null,null,null,null,null,null,null,null,null,null,null,null,null,null,"E.  PROGRAMS AND SERVICES FOR ELs AND THEIR FAMILIES (CONTINUED)",null,null,null,null,null,null,null,null,null,null,null,null,null,null,null,"E.  PROGRAMS AND SERVICES FOR ELs AND THEIR FAMILIES (CONTINUED)",null,null,null,null,null,null,null,null,null,null,null,null,null,null,null,"E.  PROGRAMS AND SERVICES FOR ELs AND THEIR FAMILIES (CONTINUED)",null,null,null,null,null,null,null,null,null,null,null,null,null,null,null,"E.  PROGRAMS AND SERVICES FOR ELs AND THEIR FAMILIES (CONTINUED)",null,null,null,null,null,null,null,null,null,null,null,null,null,null,null,"E.  PROGRAMS AND SERVICES FOR ELs AND THEIR FAMILIES (CONTINUED)",null,null,null,null,null,null,null,null,null,null,null,null,null,null,null,"E.  PROGRAMS AND SERVICES FOR ELs AND THEIR FAMILIES (CONTINUED)",null,null,null,null,null,null,null,null,null,null,null,null,null,null,null,"E.  PROGRAMS AND SERVICES FOR ELs AND THEIR FAMILIES (CONTINUED)",null,null,null,null,null,null,null,null,null,null,null,null,null,null,null,"E.  PROGRAMS AND SERVICES FOR ELs AND THEIR FAMILIES (CONTINUED)",null,null,null,null,null,null,null,null,null,null,null,null,null,null,null,"E.  PROGRAMS AND SERVICES FOR ELs AND THEIR FAMILIES (CONTINUED)",null,null,null,null,null,null,null,null,null,null,null,null,null,null,null,"E.  PROGRAMS AND SERVICES FOR ELs AND THEIR FAMILIES (CONTINUED)",null,null,null,null,null,null,null,null,null,null,null,null,null,null,null,"E.  PROGRAMS AND SERVICES FOR ELs AND THEIR FAMILIES (CONTINUED)",null,null,null,null,null,null,null,null,null,null,null,null,null,null,null,"E.  PROGRAMS AND SERVICES FOR ELs AND THEIR FAMILIES (CONTINUED)",null,null,null,null,null,null,null,null,null,null,null,null,null,null,null,"E.  PROGRAMS AND SERVICES FOR ELs AND THEIR FAMILIES (CONTINUED)",null,null,null,null,null,null,null,null,null,null,null,null,null,null,null,"E.  PROGRAMS AND SERVICES FOR ELs AND THEIR FAMILIES (CONTINUED)",null,null,null,null,null,null,null,null,null,null,null,null,null,null,null,"E.  PROGRAMS AND SERVICES FOR ELs AND THEIR FAMILIES (CONTINUED)",null,null,null,null,null,null,null,null,null,null,null,null,null,null,null,"E.  PROGRAMS AND SERVICES FOR ELs AND THEIR FAMILIES (CONTINUED)",null,null,null,null,null,null,null,null,null,null,null,null,null,null,null,"E.  PROGRAMS AND SERVICES FOR ELs AND THEIR FAMILIES (CONTINUED)",null,null,null,null,null,null,null,null,null,null,null,null,null,null,null,"E.  PROGRAMS AND SERVICES FOR ELs AND THEIR FAMILIES (CONTINUED)",null,null,null,null,null,null,null,null,null,null,null,null,null,null,null,"E.  PROGRAMS AND SERVICES FOR ELs AND THEIR FAMILIES (CONTINUED)",null,null,null,null,null,null,null,null,null,null,null,null,null,null,null,"E.  PROGRAMS AND SERVICES FOR ELs AND THEIR FAMILIES (CONTINUED)",null,null,null,null,null,null,null,null,null,null,null,null,null,null,null,"E.  PROGRAMS AND SERVICES FOR ELs AND THEIR FAMILIES (CONTINUED)",null,null,null,null,null,null,null,null,null,null,null,null,null,null,null,"E.  PROGRAMS AND SERVICES FOR ELs AND THEIR FAMILIES (CONTINUED)",null,null,null,null,null,null,null,null,null,null,null,null,null,null,null,"E.  PROGRAMS AND SERVICES FOR ELs AND THEIR FAMILIES (CONTINUED)",null,null,null,null,null,null,null,null,null,null,null,null,null,null,null,"E.  PROGRAMS AND SERVICES FOR ELs AND THEIR FAMILIES (CONTINUED)",null,null,null,null,null,null,null,null,null,null,null,null,null,null,null,"E.  PROGRAMS AND SERVICES FOR ELs AND THEIR FAMILIES (CONTINUED)",null,null,null,null,null,null,null,null,null,null,null,null,null,null,null,"E.  PROGRAMS AND SERVICES FOR ELs AND THEIR FAMILIES (CONTINUED)",null,null,null,null,null,null,null,null,null,null,null,null,null,null,null,"E.  PROGRAMS AND SERVICES FOR ELs AND THEIR FAMILIES (CONTINUED)",null,null,null,null,null,null,null,null,null,null,null,null,null,null,null,"E.  PROGRAMS AND SERVICES FOR ELs AND THEIR FAMILIES (CONTINUED)",null,null,null,null,null,null,null,null,null,null,null,null,null,null,null,"E.  PROGRAMS AND SERVICES FOR ELs AND THEIR FAMILIES (CONTINUED)",null,null,null,null,null,null,null,null,null,null,null,null,null,null,null,"E.  PROGRAMS AND SERVICES FOR ELs AND THEIR FAMILIES (CONTINUED)",null,null,null,null,null,null,null,null,null,null,null,null,null,null,null,"E.  PROGRAMS AND SERVICES FOR ELs AND THEIR FAMILIES (CONTINUED)",null,null,null,null,null,null,null,null,null,null,null,null,null,null,null,"E.  PROGRAMS AND SERVICES FOR ELs AND THEIR FAMILIES (CONTINUED)",null,null,null,null,null,null,null,null,null,null,null,null,null,null,null,"E.  PROGRAMS AND SERVICES FOR ELs AND THEIR FAMILIES (CONTINUED)",null,null,null,null,null,null,null,null,null,null,null,null,null,null,null,"E.  PROGRAMS AND SERVICES FOR ELs AND THEIR FAMILIES (CONTINUED)",null,null,null,null,null,null,null,null,null,null,null,null,null,null,null,"E.  PROGRAMS AND SERVICES FOR ELs AND THEIR FAMILIES (CONTINUED)",null,null,null,null,null,null,null,null,null,null,null,null,null,null,null,"E.  PROGRAMS AND SERVICES FOR ELs AND THEIR FAMILIES (CONTINUED)",null,null,null,null,null,null,null,null,null,null,null,null,null,null,null,"E.  PROGRAMS AND SERVICES FOR ELs AND THEIR FAMILIES (CONTINUED)",null,null,null,null,null,null,null,null,null,null,null,null,null,null,null,"E.  PROGRAMS AND SERVICES FOR ELs AND THEIR FAMILIES (CONTINUED)",null,null,null,null,null,null,null,null,null,null,null,null,null,null,null,"E.  PROGRAMS AND SERVICES FOR ELs AND THEIR FAMILIES (CONTINUED)",null,null,null,null,null,null,null,null,null,null,null,null,null,null,null,"E.  PROGRAMS AND SERVICES FOR ELs AND THEIR FAMILIES (CONTINUED)",null,null,null,null,null,null,null,null,null,null,null,null,null,null,null,"E.  PROGRAMS AND SERVICES FOR ELs AND THEIR FAMILIES (CONTINUED)",null,null,null,null,null,null,null,null,null,null,null,null,null,null,null,"E.  PROGRAMS AND SERVICES FOR ELs AND THEIR FAMILIES (CONTINUED)",null,null,null,null,null,null,null,null,null,null,null,null,null,null,null,"E.  PROGRAMS AND SERVICES FOR ELs AND THEIR FAMILIES (CONTINUED)",null,null,null,null,null,null,null,null,null,null,null,null,null,null,null,"E.  PROGRAMS AND SERVICES FOR ELs AND THEIR FAMILIES (CONTINUED)",null,null,null,null,null,null,null,null,null,null,null,null,null,null,null,"E.  PROGRAMS AND SERVICES FOR ELs AND THEIR FAMILIES (CONTINUED)",null,null,null,null,null,null,null,null,null,null,null,null,null,null,null,"E.  PROGRAMS AND SERVICES FOR ELs AND THEIR FAMILIES (CONTINUED)",null,null,null,null,null,null,null,null,null,null,null,null,null,null,null,"E.  PROGRAMS AND SERVICES FOR ELs AND THEIR FAMILIES (CONTINUED)",null,null,null,null,null,null,null,null,null,null,null,null,null,null,null,"E.  PROGRAMS AND SERVICES FOR ELs AND THEIR FAMILIES (CONTINUED)",null,null,null,null,null,null,null,null,null,null,null,null,null,null,null,"E.  PROGRAMS AND SERVICES FOR ELs AND THEIR FAMILIES (CONTINUED)",null,null,null,null,null,null,null,null,null,null,null,null,null,null,null,"E.  PROGRAMS AND SERVICES FOR ELs AND THEIR FAMILIES (CONTINUED)",null,null,null,null,null,null,null,null,null,null,null,null,null,null,null,"E.  PROGRAMS AND SERVICES FOR ELs AND THEIR FAMILIES (CONTINUED)",null,null,null,null,null,null,null,null,null,null,null,null,null,null,null,"E.  PROGRAMS AND SERVICES FOR ELs AND THEIR FAMILIES (CONTINUED)",null,null,null,null,null,null,null,null,null,null,null,null,null,null,null,"E.  PROGRAMS AND SERVICES FOR ELs AND THEIR FAMILIES (CONTINUED)",null,null,null,null,null,null,null,null,null,null,null,null,null,null,null,"E.  PROGRAMS AND SERVICES FOR ELs AND THEIR FAMILIES (CONTINUED)",null,null,null,null,null,null,null,null,null,null,null,null,null,null,null,"E.  PROGRAMS AND SERVICES FOR ELs AND THEIR FAMILIES (CONTINUED)",null,null,null,null,null,null,null,null,null,null,null,null,null,null,null,"E.  PROGRAMS AND SERVICES FOR ELs AND THEIR FAMILIES (CONTINUED)",null,null,null,null,null,null,null,null,null,null,null,null,null,null,null,"E.  PROGRAMS AND SERVICES FOR ELs AND THEIR FAMILIES (CONTINUED)",null,null,null,null,null,null,null,null,null,null,null,null,null,null,null,"E.  PROGRAMS AND SERVICES FOR ELs AND THEIR FAMILIES (CONTINUED)",null,null,null,null,null,null,null,null,null,null,null,null,null,null,null,"E.  PROGRAMS AND SERVICES FOR ELs AND THEIR FAMILIES (CONTINUED)",null,null,null,null,null,null,null,null,null,null,null,null,null,null,null,"E.  PROGRAMS AND SERVICES FOR ELs AND THEIR FAMILIES (CONTINUED)",null,null,null,null,null,null,null,null,null,null,null,null,null,null,null,"E.  PROGRAMS AND SERVICES FOR ELs AND THEIR FAMILIES (CONTINUED)",null,null,null,null,null,null,null,null,null,null,null,null,null,null,null,"E.  PROGRAMS AND SERVICES FOR ELs AND THEIR FAMILIES (CONTINUED)",null,null,null,null,null,null,null,null,null,null,null,null,null,null,null,"E.  PROGRAMS AND SERVICES FOR ELs AND THEIR FAMILIES (CONTINUED)",null,null,null,null,null,null,null,null,null,null,null,null,null,null,null,"E.  PROGRAMS AND SERVICES FOR ELs AND THEIR FAMILIES (CONTINUED)",null,null,null,null,null,null,null,null,null,null,null,null,null,null,null,"E.  PROGRAMS AND SERVICES FOR ELs AND THEIR FAMILIES (CONTINUED)",null,null,null,null,null,null,null,null,null,null,null,null,null,null,null,"E.  PROGRAMS AND SERVICES FOR ELs AND THEIR FAMILIES (CONTINUED)",null,null,null,null,null,null,null,null,null,null,null,null,null,null,null,"E.  PROGRAMS AND SERVICES FOR ELs AND THEIR FAMILIES (CONTINUED)",null,null,null,null,null,null,null,null,null,null,null,null,null,null,null,"E.  PROGRAMS AND SERVICES FOR ELs AND THEIR FAMILIES (CONTINUED)",null,null,null,null,null,null,null,null,null,null,null,null,null,null,null,"E.  PROGRAMS AND SERVICES FOR ELs AND THEIR FAMILIES (CONTINUED)",null,null,null,null,null,null,null,null,null,null,null,null,null,null,null,"E.  PROGRAMS AND SERVICES FOR ELs AND THEIR FAMILIES (CONTINUED)",null,null,null,null,null,null,null,null,null,null,null,null,null,null,null,"E.  PROGRAMS AND SERVICES FOR ELs AND THEIR FAMILIES (CONTINUED)",null,null,null,null,null,null,null,null,null,null,null,null,null,null,null,"E.  PROGRAMS AND SERVICES FOR ELs AND THEIR FAMILIES (CONTINUED)",null,null,null,null,null,null,null,null,null,null,null,null,null,null,null,"E.  PROGRAMS AND SERVICES FOR ELs AND THEIR FAMILIES (CONTINUED)",null,null,null,null,null,null,null,null,null,null,null,null,null,null,null,"E.  PROGRAMS AND SERVICES FOR ELs AND THEIR FAMILIES (CONTINUED)",null,null,null,null,null,null,null,null,null,null,null,null,null,null,null,"E.  PROGRAMS AND SERVICES FOR ELs AND THEIR FAMILIES (CONTINUED)",null,null,null,null,null,null,null,null,null,null,null,null,null,null,null,"E.  PROGRAMS AND SERVICES FOR ELs AND THEIR FAMILIES (CONTINUED)",null,null,null,null,null,null,null,null,null,null,null,null,null,null,null,"E.  PROGRAMS AND SERVICES FOR ELs AND THEIR FAMILIES (CONTINUED)",null,null,null,null,null,null,null,null,null,null,null,null,null,null,null,"E.  PROGRAMS AND SERVICES FOR ELs AND THEIR FAMILIES (CONTINUED)",null,null,null,null,null,null,null,null,null,null,null,null,null,null,null,"E.  PROGRAMS AND SERVICES FOR ELs AND THEIR FAMILIES (CONTINUED)",null,null,null,null,null,null,null,null,null,null,null,null,null,null,null,"E.  PROGRAMS AND SERVICES FOR ELs AND THEIR FAMILIES (CONTINUED)",null,null,null,null,null,null,null,null,null,null,null,null,null,null,null,"E.  PROGRAMS AND SERVICES FOR ELs AND THEIR FAMILIES (CONTINUED)",null,null,null,null,null,null,null,null,null,null,null,null,null,null,null,"E.  PROGRAMS AND SERVICES FOR ELs AND THEIR FAMILIES (CONTINUED)",null,null,null,null,null,null,null,null,null,null,null,null,null,null,null,"E.  PROGRAMS AND SERVICES FOR ELs AND THEIR FAMILIES (CONTINUED)",null,null,null,null,null,null,null,null,null,null,null,null,null,null,null,"E.  PROGRAMS AND SERVICES FOR ELs AND THEIR FAMILIES (CONTINUED)",null,null,null,null,null,null,null,null,null,null,null,null,null,null,null,"E.  PROGRAMS AND SERVICES FOR ELs AND THEIR FAMILIES (CONTINUED)",null,null,null,null,null,null,null,null,null,null,null,null,null,null,null,"E.  PROGRAMS AND SERVICES FOR ELs AND THEIR FAMILIES (CONTINUED)",null,null,null,null,null,null,null,null,null,null,null,null,null,null,null,"E.  PROGRAMS AND SERVICES FOR ELs AND THEIR FAMILIES (CONTINUED)",null,null,null,null,null,null,null,null,null,null,null,null,null,null,null,"E.  PROGRAMS AND SERVICES FOR ELs AND THEIR FAMILIES (CONTINUED)",null,null,null,null,null,null,null,null,null,null,null,null,null,null,null,"E.  PROGRAMS AND SERVICES FOR ELs AND THEIR FAMILIES (CONTINUED)",null,null,null,null,null,null,null,null,null,null,null,null,null,null,null,"E.  PROGRAMS AND SERVICES FOR ELs AND THEIR FAMILIES (CONTINUED)",null,null,null,null,null,null,null,null,null,null,null,null,null,null,null,"E.  PROGRAMS AND SERVICES FOR ELs AND THEIR FAMILIES (CONTINUED)",null,null,null,null,null,null,null,null,null,null,null,null,null,null,null,"E.  PROGRAMS AND SERVICES FOR ELs AND THEIR FAMILIES (CONTINUED)",null,null,null,null,null,null,null,null,null,null,null,null,null,null,null,"E.  PROGRAMS AND SERVICES FOR ELs AND THEIR FAMILIES (CONTINUED)",null,null,null,null,null,null,null,null,null,null,null,null,null,null,null,"E.  PROGRAMS AND SERVICES FOR ELs AND THEIR FAMILIES (CONTINUED)",null,null,null,null,null,null,null,null,null,null,null,null,null,null,null,"E.  PROGRAMS AND SERVICES FOR ELs AND THEIR FAMILIES (CONTINUED)",null,null,null,null,null,null,null,null,null,null,null,null,null,null,null,"E.  PROGRAMS AND SERVICES FOR ELs AND THEIR FAMILIES (CONTINUED)",null,null,null,null,null,null,null,null,null,null,null,null,null,null,null,"E.  PROGRAMS AND SERVICES FOR ELs AND THEIR FAMILIES (CONTINUED)",null,null,null,null,null,null,null,null,null,null,null,null,null,null,null,"E.  PROGRAMS AND SERVICES FOR ELs AND THEIR FAMILIES (CONTINUED)",null,null,null,null,null,null,null,null,null,null,null,null,null,null,null,"E.  PROGRAMS AND SERVICES FOR ELs AND THEIR FAMILIES (CONTINUED)",null,null,null,null,null,null,null,null,null,null,null,null,null,null,null,"E.  PROGRAMS AND SERVICES FOR ELs AND THEIR FAMILIES (CONTINUED)",null,null,null,null,null,null,null,null,null,null,null,null,null,null,null,"E.  PROGRAMS AND SERVICES FOR ELs AND THEIR FAMILIES (CONTINUED)",null,null,null,null,null,null,null,null,null,null,null,null,null,null,null,"E.  PROGRAMS AND SERVICES FOR ELs AND THEIR FAMILIES (CONTINUED)",null,null,null,null,null,null,null,null,null,null,null,null,null,null,null,"E.  PROGRAMS AND SERVICES FOR ELs AND THEIR FAMILIES (CONTINUED)",null,null,null,null,null,null,null,null,null,null,null,null,null,null,null,"E.  PROGRAMS AND SERVICES FOR ELs AND THEIR FAMILIES (CONTINUED)",null,null,null,null,null,null,null,null,null,null,null,null,null,null,null,"E.  PROGRAMS AND SERVICES FOR ELs AND THEIR FAMILIES (CONTINUED)",null,null,null,null,null,null,null,null,null,null,null,null,null,null,null,"E.  PROGRAMS AND SERVICES FOR ELs AND THEIR FAMILIES (CONTINUED)",null,null,null,null,null,null,null,null,null,null,null,null,null,null,null,"E.  PROGRAMS AND SERVICES FOR ELs AND THEIR FAMILIES (CONTINUED)",null,null,null,null,null,null,null,null,null,null,null,null,null,null,null,"E.  PROGRAMS AND SERVICES FOR ELs AND THEIR FAMILIES (CONTINUED)",null,null,null,null,null,null,null,null,null,null,null,null,null,null,null,"E.  PROGRAMS AND SERVICES FOR ELs AND THEIR FAMILIES (CONTINUED)",null,null,null,null,null,null,null,null,null,null,null,null,null,null,null,"E.  PROGRAMS AND SERVICES FOR ELs AND THEIR FAMILIES (CONTINUED)",null,null,null,null,null,null,null,null,null,null,null,null,null,null,null,"E.  PROGRAMS AND SERVICES FOR ELs AND THEIR FAMILIES (CONTINUED)",null,null,null,null,null,null,null,null,null,null,null,null,null,null,null,"E.  PROGRAMS AND SERVICES FOR ELs AND THEIR FAMILIES (CONTINUED)",null,null,null,null,null,null,null,null,null,null,null,null,null,null,null,"E.  PROGRAMS AND SERVICES FOR ELs AND THEIR FAMILIES (CONTINUED)",null,null,null,null,null,null,null,null,null,null,null,null,null,null,null,"E.  PROGRAMS AND SERVICES FOR ELs AND THEIR FAMILIES (CONTINUED)",null,null,null,null,null,null,null,null,null,null,null,null,null,null,null,"E.  PROGRAMS AND SERVICES FOR ELs AND THEIR FAMILIES (CONTINUED)",null,null,null,null,null,null,null,null,null,null,null,null,null,null,null,"E.  PROGRAMS AND SERVICES FOR ELs AND THEIR FAMILIES (CONTINUED)",null,null,null,null,null,null,null,null,null,null,null,null,null,null,null,"E.  PROGRAMS AND SERVICES FOR ELs AND THEIR FAMILIES (CONTINUED)",null,null,null,null,null,null,null,null,null,null,null,null,null,null,null,"E.  PROGRAMS AND SERVICES FOR ELs AND THEIR FAMILIES (CONTINUED)",null,null,null,null,null,null,null,null,null,null,null,null,null,null,null,"E.  PROGRAMS AND SERVICES FOR ELs AND THEIR FAMILIES (CONTINUED)",null,null,null,null,null,null,null,null,null,null,null,null,null,null,null,"E.  PROGRAMS AND SERVICES FOR ELs AND THEIR FAMILIES (CONTINUED)",null,null,null,null,null,null,null,null,null,null,null,null,null,null,null,"E.  PROGRAMS AND SERVICES FOR ELs AND THEIR FAMILIES (CONTINUED)",null,null,null,null,null,null,null,null,null,null,null,null,null,null,null,"E.  PROGRAMS AND SERVICES FOR ELs AND THEIR FAMILIES (CONTINUED)",null,null,null,null,null,null,null,null,null,null,null,null,null,null,null,"E.  PROGRAMS AND SERVICES FOR ELs AND THEIR FAMILIES (CONTINUED)",null,null,null,null,null,null,null,null,null,null,null,null,null,null,null,"E.  PROGRAMS AND SERVICES FOR ELs AND THEIR FAMILIES (CONTINUED)",null,null,null,null,null,null,null,null,null,null,null,null,null,null,null,"E.  PROGRAMS AND SERVICES FOR ELs AND THEIR FAMILIES (CONTINUED)",null,null,null,null,null,null,null,null,null,null,null,null,null,null,null,"E.  PROGRAMS AND SERVICES FOR ELs AND THEIR FAMILIES (CONTINUED)",null,null,null,null,null,null,null,null,null,null,null,null,null,null,null,"E.  PROGRAMS AND SERVICES FOR ELs AND THEIR FAMILIES (CONTINUED)",null,null,null,null,null,null,null,null,null,null,null,null,null,null,null,"E.  PROGRAMS AND SERVICES FOR ELs AND THEIR FAMILIES (CONTINUED)",null,null,null,null,null,null,null,null,null,null,null,null,null,null,null,"E.  PROGRAMS AND SERVICES FOR ELs AND THEIR FAMILIES (CONTINUED)",null,null,null,null,null,null,null,null,null,null,null,null,null,null,null,"E.  PROGRAMS AND SERVICES FOR ELs AND THEIR FAMILIES (CONTINUED)",null,null,null,null,null,null,null,null,null,null,null,null,null,null,null,"E.  PROGRAMS AND SERVICES FOR ELs AND THEIR FAMILIES (CONTINUED)",null,null,null,null,null,null,null,null,null,null,null,null,null,null,null,"E.  PROGRAMS AND SERVICES FOR ELs AND THEIR FAMILIES (CONTINUED)",null,null,null,null,null,null,null,null,null,null,null,null,null,null,null,"E.  PROGRAMS AND SERVICES FOR ELs AND THEIR FAMILIES (CONTINUED)",null,null,null,null,null,null,null,null,null,null,null,null,null,null,null,"E.  PROGRAMS AND SERVICES FOR ELs AND THEIR FAMILIES (CONTINUED)",null,null,null,null,null,null,null,null,null,null,null,null,null,null,null,"E.  PROGRAMS AND SERVICES FOR ELs AND THEIR FAMILIES (CONTINUED)",null,null,null,null,null,null,null,null,null,null,null,null,null,null,null,"E.  PROGRAMS AND SERVICES FOR ELs AND THEIR FAMILIES (CONTINUED)",null,null,null,null,null,null,null,null,null,null,null,null,null,null,null,"E.  PROGRAMS AND SERVICES FOR ELs AND THEIR FAMILIES (CONTINUED)",null,null,null,null,null,null,null,null,null,null,null,null,null,null,null,"E.  PROGRAMS AND SERVICES FOR ELs AND THEIR FAMILIES (CONTINUED)",null,null,null,null,null,null,null,null,null,null,null,null,null,null,null,"E.  PROGRAMS AND SERVICES FOR ELs AND THEIR FAMILIES (CONTINUED)",null,null,null,null,null,null,null,null,null,null,null,null,null,null,null,"E.  PROGRAMS AND SERVICES FOR ELs AND THEIR FAMILIES (CONTINUED)",null,null,null,null,null,null,null,null,null,null,null,null,null,null,null,"E.  PROGRAMS AND SERVICES FOR ELs AND THEIR FAMILIES (CONTINUED)",null,null,null,null,null,null,null,null,null,null,null,null,null,null,null,"E.  PROGRAMS AND SERVICES FOR ELs AND THEIR FAMILIES (CONTINUED)",null,null,null,null,null,null,null,null,null,null,null,null,null,null,null,"E.  PROGRAMS AND SERVICES FOR ELs AND THEIR FAMILIES (CONTINUED)",null,null,null,null,null,null,null,null,null,null,null,null,null,null,null,"E.  PROGRAMS AND SERVICES FOR ELs AND THEIR FAMILIES (CONTINUED)",null,null,null,null,null,null,null,null,null,null,null,null,null,null,null,"E.  PROGRAMS AND SERVICES FOR ELs AND THEIR FAMILIES (CONTINUED)",null,null,null,null,null,null,null,null,null,null,null,null,null,null,null,"E.  PROGRAMS AND SERVICES FOR ELs AND THEIR FAMILIES (CONTINUED)",null,null,null,null,null,null,null,null,null,null,null,null,null,null,null,"E.  PROGRAMS AND SERVICES FOR ELs AND THEIR FAMILIES (CONTINUED)",null,null,null,null,null,null,null,null,null,null,null,null,null,null,null,"E.  PROGRAMS AND SERVICES FOR ELs AND THEIR FAMILIES (CONTINUED)",null,null,null,null,null,null,null,null,null,null,null,null,null,null,null,"E.  PROGRAMS AND SERVICES FOR ELs AND THEIR FAMILIES (CONTINUED)",null,null,null,null,null,null,null,null,null,null,null,null,null,null,null,"E.  PROGRAMS AND SERVICES FOR ELs AND THEIR FAMILIES (CONTINUED)",null,null,null,null,null,null,null,null,null,null,null,null,null,null,null,"E.  PROGRAMS AND SERVICES FOR ELs AND THEIR FAMILIES (CONTINUED)",null,null,null,null,null,null,null,null,null,null,null,null,null,null,null,"E.  PROGRAMS AND SERVICES FOR ELs AND THEIR FAMILIES (CONTINUED)",null,null,null,null,null,null,null,null,null,null,null,null,null,null,null,"E.  PROGRAMS AND SERVICES FOR ELs AND THEIR FAMILIES (CONTINUED)",null,null,null,null,null,null,null,null,null,null,null,null,null,null,null,"E.  PROGRAMS AND SERVICES FOR ELs AND THEIR FAMILIES (CONTINUED)",null,null,null,null,null,null,null,null,null,null,null,null,null,null,null,"E.  PROGRAMS AND SERVICES FOR ELs AND THEIR FAMILIES (CONTINUED)",null,null,null,null,null,null,null,null,null,null,null,null,null,null,null,"E.  PROGRAMS AND SERVICES FOR ELs AND THEIR FAMILIES (CONTINUED)",null,null,null,null,null,null,null,null,null,null,null,null,null,null,null,"E.  PROGRAMS AND SERVICES FOR ELs AND THEIR FAMILIES (CONTINUED)",null,null,null,null,null,null,null,null,null,null,null,null,null,null,null,"E.  PROGRAMS AND SERVICES FOR ELs AND THEIR FAMILIES (CONTINUED)",null,null,null,null,null,null,null,null,null,null,null,null,null,null,null,"E.  PROGRAMS AND SERVICES FOR ELs AND THEIR FAMILIES (CONTINUED)",null,null,null,null,null,null,null,null,null,null,null,null,null,null,null,"E.  PROGRAMS AND SERVICES FOR ELs AND THEIR FAMILIES (CONTINUED)",null,null,null,null,null,null,null,null,null,null,null,null,null,null,null,"E.  PROGRAMS AND SERVICES FOR ELs AND THEIR FAMILIES (CONTINUED)",null,null,null,null,null,null,null,null,null,null,null,null,null,null,null,"E.  PROGRAMS AND SERVICES FOR ELs AND THEIR FAMILIES (CONTINUED)",null,null,null,null,null,null,null,null,null,null,null,null,null,null,null,"E.  PROGRAMS AND SERVICES FOR ELs AND THEIR FAMILIES (CONTINUED)",null,null,null,null,null,null,null,null,null,null,null,null,null,null,null,"E.  PROGRAMS AND SERVICES FOR ELs AND THEIR FAMILIES (CONTINUED)",null,null,null,null,null,null,null,null,null,null,null,null,null,null,null,"E.  PROGRAMS AND SERVICES FOR ELs AND THEIR FAMILIES (CONTINUED)",null,null,null,null,null,null,null,null,null,null,null,null,null,null,null,"E.  PROGRAMS AND SERVICES FOR ELs AND THEIR FAMILIES (CONTINUED)",null,null,null,null,null,null,null,null,null,null,null,null,null,null,null,"E.  PROGRAMS AND SERVICES FOR ELs AND THEIR FAMILIES (CONTINUED)",null,null,null,null,null,null,null,null,null,null,null,null,null,null,null,"E.  PROGRAMS AND SERVICES FOR ELs AND THEIR FAMILIES (CONTINUED)",null,null,null,null,null,null,null,null,null,null,null,null,null,null,null,"E.  PROGRAMS AND SERVICES FOR ELs AND THEIR FAMILIES (CONTINUED)",null,null,null,null,null,null,null,null,null,null,null,null,null,null,null,"E.  PROGRAMS AND SERVICES FOR ELs AND THEIR FAMILIES (CONTINUED)",null,null,null,null,null,null,null,null,null,null,null,null,null,null,null,"E.  PROGRAMS AND SERVICES FOR ELs AND THEIR FAMILIES (CONTINUED)",null,null,null,null,null,null,null,null,null,null,null,null,null,null,null,"E.  PROGRAMS AND SERVICES FOR ELs AND THEIR FAMILIES (CONTINUED)",null,null,null,null,null,null,null,null,null,null,null,null,null,null,null,"E.  PROGRAMS AND SERVICES FOR ELs AND THEIR FAMILIES (CONTINUED)",null,null,null,null,null,null,null,null,null,null,null,null,null,null,null,"E.  PROGRAMS AND SERVICES FOR ELs AND THEIR FAMILIES (CONTINUED)",null,null,null,null,null,null,null,null,null,null,null,null,null,null,null,"E.  PROGRAMS AND SERVICES FOR ELs AND THEIR FAMILIES (CONTINUED)",null,null,null,null,null,null,null,null,null,null,null,null,null,null,null,"E.  PROGRAMS AND SERVICES FOR ELs AND THEIR FAMILIES (CONTINUED)",null,null,null,null,null,null,null,null,null,null,null,null,null,null,null,"E.  PROGRAMS AND SERVICES FOR ELs AND THEIR FAMILIES (CONTINUED)",null,null,null,null,null,null,null,null,null,null,null,null,null,null,null,"E.  PROGRAMS AND SERVICES FOR ELs AND THEIR FAMILIES (CONTINUED)",null,null,null,null,null,null,null,null,null,null,null,null,null,null,null,"E.  PROGRAMS AND SERVICES FOR ELs AND THEIR FAMILIES (CONTINUED)",null,null,null,null,null,null,null,null,null,null,null,null,null,null,null,"E.  PROGRAMS AND SERVICES FOR ELs AND THEIR FAMILIES (CONTINUED)",null,null,null,null,null,null,null,null,null,null,null,null,null,null,null,"E.  PROGRAMS AND SERVICES FOR ELs AND THEIR FAMILIES (CONTINUED)",null,null,null,null,null,null,null,null,null,null,null,null,null,null,null,"E.  PROGRAMS AND SERVICES FOR ELs AND THEIR FAMILIES (CONTINUED)",null,null,null,null,null,null,null,null,null,null,null,null,null,null,null,"E.  PROGRAMS AND SERVICES FOR ELs AND THEIR FAMILIES (CONTINUED)",null,null,null,null,null,null,null,null,null,null,null,null,null,null,null,"E.  PROGRAMS AND SERVICES FOR ELs AND THEIR FAMILIES (CONTINUED)",null,null,null,null,null,null,null,null,null,null,null,null,null,null,null,"E.  PROGRAMS AND SERVICES FOR ELs AND THEIR FAMILIES (CONTINUED)",null,null,null,null,null,null,null,null,null,null,null,null,null,null,null,"E.  PROGRAMS AND SERVICES FOR ELs AND THEIR FAMILIES (CONTINUED)",null,null,null,null,null,null,null,null,null,null,null,null,null,null,null,"E.  PROGRAMS AND SERVICES FOR ELs AND THEIR FAMILIES (CONTINUED)",null,null,null,null,null,null,null,null,null,null,null,null,null,null,null,"E.  PROGRAMS AND SERVICES FOR ELs AND THEIR FAMILIES (CONTINUED)",null,null,null,null,null,null,null,null,null,null,null,null,null,null,null,"E.  PROGRAMS AND SERVICES FOR ELs AND THEIR FAMILIES (CONTINUED)",null,null,null,null,null,null,null,null,null,null,null,null,null,null,null,"E.  PROGRAMS AND SERVICES FOR ELs AND THEIR FAMILIES (CONTINUED)",null,null,null,null,null,null,null,null,null,null,null,null,null,null,null,"E.  PROGRAMS AND SERVICES FOR ELs AND THEIR FAMILIES (CONTINUED)",null,null,null,null,null,null,null,null,null,null,null,null,null,null,null,"E.  PROGRAMS AND SERVICES FOR ELs AND THEIR FAMILIES (CONTINUED)",null,null,null,null,null,null,null,null,null,null,null,null,null,null,null,"E.  PROGRAMS AND SERVICES FOR ELs AND THEIR FAMILIES (CONTINUED)",null,null,null,null,null,null,null,null,null,null,null,null,null,null,null,"E.  PROGRAMS AND SERVICES FOR ELs AND THEIR FAMILIES (CONTINUED)",null,null,null,null,null,null,null,null,null,null,null,null,null,null,null,"E.  PROGRAMS AND SERVICES FOR ELs AND THEIR FAMILIES (CONTINUED)",null,null,null,null,null,null,null,null,null,null,null,null,null,null,null,"E.  PROGRAMS AND SERVICES FOR ELs AND THEIR FAMILIES (CONTINUED)",null,null,null,null,null,null,null,null,null,null,null,null,null,null,null,"E.  PROGRAMS AND SERVICES FOR ELs AND THEIR FAMILIES (CONTINUED)",null,null,null,null,null,null,null,null,null,null,null,null,null,null,null,"E.  PROGRAMS AND SERVICES FOR ELs AND THEIR FAMILIES (CONTINUED)",null,null,null,null,null,null,null,null,null,null,null,null,null,null,null,"E.  PROGRAMS AND SERVICES FOR ELs AND THEIR FAMILIES (CONTINUED)",null,null,null,null,null,null,null,null,null,null,null,null,null,null,null,"E.  PROGRAMS AND SERVICES FOR ELs AND THEIR FAMILIES (CONTINUED)",null,null,null,null,null,null,null,null,null,null,null,null,null,null,null,"E.  PROGRAMS AND SERVICES FOR ELs AND THEIR FAMILIES (CONTINUED)",null,null,null,null,null,null,null,null,null,null,null,null,null,null,null,"E.  PROGRAMS AND SERVICES FOR ELs AND THEIR FAMILIES (CONTINUED)",null,null,null,null,null,null,null,null,null,null,null,null,null,null,null,"E.  PROGRAMS AND SERVICES FOR ELs AND THEIR FAMILIES (CONTINUED)",null,null,null,null,null,null,null,null,null,null,null,null,null,null,null,"E.  PROGRAMS AND SERVICES FOR ELs AND THEIR FAMILIES (CONTINUED)",null,null,null,null,null,null,null,null,null,null,null,null,null,null,null,"E.  PROGRAMS AND SERVICES FOR ELs AND THEIR FAMILIES (CONTINUED)",null,null,null,null,null,null,null,null,null,null,null,null,null,null,null,"E.  PROGRAMS AND SERVICES FOR ELs AND THEIR FAMILIES (CONTINUED)",null,null,null,null,null,null,null,null,null,null,null,null,null,null,null,"E.  PROGRAMS AND SERVICES FOR ELs AND THEIR FAMILIES (CONTINUED)",null,null,null,null,null,null,null,null,null,null,null,null,null,null,null,"E.  PROGRAMS AND SERVICES FOR ELs AND THEIR FAMILIES (CONTINUED)",null,null,null,null,null,null,null,null,null,null,null,null,null,null,null,"E.  PROGRAMS AND SERVICES FOR ELs AND THEIR FAMILIES (CONTINUED)",null,null,null,null,null,null,null,null,null,null,null,null,null,null,null,"E.  PROGRAMS AND SERVICES FOR ELs AND THEIR FAMILIES (CONTINUED)",null,null,null,null,null,null,null,null,null,null,null,null,null,null,null,"E.  PROGRAMS AND SERVICES FOR ELs AND THEIR FAMILIES (CONTINUED)",null,null,null,null,null,null,null,null,null,null,null,null,null,null,null,"E.  PROGRAMS AND SERVICES FOR ELs AND THEIR FAMILIES (CONTINUED)",null,null,null,null,null,null,null,null,null,null,null,null,null,null,null,"E.  PROGRAMS AND SERVICES FOR ELs AND THEIR FAMILIES (CONTINUED)",null,null,null,null,null,null,null,null,null,null,null,null,null,null,null,"E.  PROGRAMS AND SERVICES FOR ELs AND THEIR FAMILIES (CONTINUED)",null,null,null,null,null,null,null,null,null,null,null,null,null,null,null,"E.  PROGRAMS AND SERVICES FOR ELs AND THEIR FAMILIES (CONTINUED)",null,null,null,null,null,null,null,null,null,null,null,null,null,null,null,"E.  PROGRAMS AND SERVICES FOR ELs AND THEIR FAMILIES (CONTINUED)",null,null,null,null,null,null,null,null,null,null,null,null,null,null,null,"E.  PROGRAMS AND SERVICES FOR ELs AND THEIR FAMILIES (CONTINUED)",null,null,null,null,null,null,null,null,null,null,null,null,null,null,null,"E.  PROGRAMS AND SERVICES FOR ELs AND THEIR FAMILIES (CONTINUED)",null,null,null,null,null,null,null,null,null,null,null,null,null,null,null,"E.  PROGRAMS AND SERVICES FOR ELs AND THEIR FAMILIES (CONTINUED)",null,null,null,null,null,null,null,null,null,null,null,null,null,null,null,"E.  PROGRAMS AND SERVICES FOR ELs AND THEIR FAMILIES (CONTINUED)",null,null,null,null,null,null,null,null,null,null,null,null,null,null,null,"E.  PROGRAMS AND SERVICES FOR ELs AND THEIR FAMILIES (CONTINUED)",null,null,null,null,null,null,null,null,null,null,null,null,null,null,null,"E.  PROGRAMS AND SERVICES FOR ELs AND THEIR FAMILIES (CONTINUED)",null,null,null,null,null,null,null,null,null,null,null,null,null,null,null,"E.  PROGRAMS AND SERVICES FOR ELs AND THEIR FAMILIES (CONTINUED)",null,null,null,null,null,null,null,null,null,null,null,null,null,null,null,"E.  PROGRAMS AND SERVICES FOR ELs AND THEIR FAMILIES (CONTINUED)",null,null,null,null,null,null,null,null,null,null,null,null,null,null,null,"E.  PROGRAMS AND SERVICES FOR ELs AND THEIR FAMILIES (CONTINUED)",null,null,null,null,null,null,null,null,null,null,null,null,null,null,null,"E.  PROGRAMS AND SERVICES FOR ELs AND THEIR FAMILIES (CONTINUED)",null,null,null,null,null,null,null,null,null,null,null,null,null,null,null,"E.  PROGRAMS AND SERVICES FOR ELs AND THEIR FAMILIES (CONTINUED)",null,null,null,null,null,null,null,null,null,null,null,null,null,null,null,"E.  PROGRAMS AND SERVICES FOR ELs AND THEIR FAMILIES (CONTINUED)",null,null,null,null,null,null,null,null,null,null,null,null,null,null,null,"E.  PROGRAMS AND SERVICES FOR ELs AND THEIR FAMILIES (CONTINUED)",null,null,null,null,null,null,null,null,null,null,null,null,null,null,null,"E.  PROGRAMS AND SERVICES FOR ELs AND THEIR FAMILIES (CONTINUED)",null,null,null,null,null,null,null,null,null,null,null,null,null,null,null,"E.  PROGRAMS AND SERVICES FOR ELs AND THEIR FAMILIES (CONTINUED)",null,null,null,null,null,null,null,null,null,null,null,null,null,null,null,"E.  PROGRAMS AND SERVICES FOR ELs AND THEIR FAMILIES (CONTINUED)",null,null,null,null,null,null,null,null,null,null,null,null,null,null,null,"E.  PROGRAMS AND SERVICES FOR ELs AND THEIR FAMILIES (CONTINUED)",null,null,null,null,null,null,null,null,null,null,null,null,null,null,null,"E.  PROGRAMS AND SERVICES FOR ELs AND THEIR FAMILIES (CONTINUED)",null,null,null,null,null,null,null,null,null,null,null,null,null,null,null,"E.  PROGRAMS AND SERVICES FOR ELs AND THEIR FAMILIES (CONTINUED)",null,null,null,null,null,null,null,null,null,null,null,null,null,null,null,"E.  PROGRAMS AND SERVICES FOR ELs AND THEIR FAMILIES (CONTINUED)",null,null,null,null,null,null,null,null,null,null,null,null,null,null,null,"E.  PROGRAMS AND SERVICES FOR ELs AND THEIR FAMILIES (CONTINUED)",null,null,null,null,null,null,null,null,null,null,null,null,null,null,null,"E.  PROGRAMS AND SERVICES FOR ELs AND THEIR FAMILIES (CONTINUED)",null,null,null,null,null,null,null,null,null,null,null,null,null,null,null,"E.  PROGRAMS AND SERVICES FOR ELs AND THEIR FAMILIES (CONTINUED)",null,null,null,null,null,null,null,null,null,null,null,null,null,null,null,"E.  PROGRAMS AND SERVICES FOR ELs AND THEIR FAMILIES (CONTINUED)",null,null,null,null,null,null,null,null,null,null,null,null,null,null,null,"E.  PROGRAMS AND SERVICES FOR ELs AND THEIR FAMILIES (CONTINUED)",null,null,null,null,null,null,null,null,null,null,null,null,null,null,null,"E.  PROGRAMS AND SERVICES FOR ELs AND THEIR FAMILIES (CONTINUED)",null,null,null,null,null,null,null,null,null,null,null,null,null,null,null,"E.  PROGRAMS AND SERVICES FOR ELs AND THEIR FAMILIES (CONTINUED)",null,null,null,null,null,null,null,null,null,null,null,null,null,null,null,"E.  PROGRAMS AND SERVICES FOR ELs AND THEIR FAMILIES (CONTINUED)",null,null,null,null,null,null,null,null,null,null,null,null,null,null,null,"E.  PROGRAMS AND SERVICES FOR ELs AND THEIR FAMILIES (CONTINUED)",null,null,null,null,null,null,null,null,null,null,null,null,null,null,null,"E.  PROGRAMS AND SERVICES FOR ELs AND THEIR FAMILIES (CONTINUED)",null,null,null,null,null,null,null,null,null,null,null,null,null,null,null,"E.  PROGRAMS AND SERVICES FOR ELs AND THEIR FAMILIES (CONTINUED)",null,null,null,null,null,null,null,null,null,null,null,null,null,null,null,"E.  PROGRAMS AND SERVICES FOR ELs AND THEIR FAMILIES (CONTINUED)",null,null,null,null,null,null,null,null,null,null,null,null,null,null,null,"E.  PROGRAMS AND SERVICES FOR ELs AND THEIR FAMILIES (CONTINUED)",null,null,null,null,null,null,null,null,null,null,null,null,null,null,null,"E.  PROGRAMS AND SERVICES FOR ELs AND THEIR FAMILIES (CONTINUED)",null,null,null,null,null,null,null,null,null,null,null,null,null,null,null,"E.  PROGRAMS AND SERVICES FOR ELs AND THEIR FAMILIES (CONTINUED)",null,null,null,null,null,null,null,null,null,null,null,null,null,null,null,"E.  PROGRAMS AND SERVICES FOR ELs AND THEIR FAMILIES (CONTINUED)",null,null,null,null,null,null,null,null,null,null,null,null,null,null,null,"E.  PROGRAMS AND SERVICES FOR ELs AND THEIR FAMILIES (CONTINUED)",null,null,null,null,null,null,null,null,null,null,null,null,null,null,null,"E.  PROGRAMS AND SERVICES FOR ELs AND THEIR FAMILIES (CONTINUED)",null,null,null,null,null,null,null,null,null,null,null,null,null,null,null,"E.  PROGRAMS AND SERVICES FOR ELs AND THEIR FAMILIES (CONTINUED)",null,null,null,null,null,null,null,null,null,null,null,null,null,null,null,"E.  PROGRAMS AND SERVICES FOR ELs AND THEIR FAMILIES (CONTINUED)",null,null,null,null,null,null,null,null,null,null,null,null,null,null,null,"E.  PROGRAMS AND SERVICES FOR ELs AND THEIR FAMILIES (CONTINUED)",null,null,null,null,null,null,null,null,null,null,null,null,null,null,null,"E.  PROGRAMS AND SERVICES FOR ELs AND THEIR FAMILIES (CONTINUED)",null,null,null,null,null,null,null,null,null,null,null,null,null,null,null,"E.  PROGRAMS AND SERVICES FOR ELs AND THEIR FAMILIES (CONTINUED)",null,null,null,null,null,null,null,null,null,null,null,null,null,null,null,"E.  PROGRAMS AND SERVICES FOR ELs AND THEIR FAMILIES (CONTINUED)",null,null,null,null,null,null,null,null,null,null,null,null,null,null,null,"E.  PROGRAMS AND SERVICES FOR ELs AND THEIR FAMILIES (CONTINUED)",null,null,null,null,null,null,null,null,null,null,null,null,null,null,null,"E.  PROGRAMS AND SERVICES FOR ELs AND THEIR FAMILIES (CONTINUED)",null,null,null,null,null,null,null,null,null,null,null,null,null,null,null,"E.  PROGRAMS AND SERVICES FOR ELs AND THEIR FAMILIES (CONTINUED)",null,null,null,null,null,null,null,null,null,null,null,null,null,null,null,"E.  PROGRAMS AND SERVICES FOR ELs AND THEIR FAMILIES (CONTINUED)",null,null,null,null,null,null,null,null,null,null,null,null,null,null,null,"E.  PROGRAMS AND SERVICES FOR ELs AND THEIR FAMILIES (CONTINUED)",null,null,null,null,null,null,null,null,null,null,null,null,null,null,null,"E.  PROGRAMS AND SERVICES FOR ELs AND THEIR FAMILIES (CONTINUED)",null,null,null,null,null,null,null,null,null,null,null,null,null,null,null,"E.  PROGRAMS AND SERVICES FOR ELs AND THEIR FAMILIES (CONTINUED)",null,null,null,null,null,null,null,null,null,null,null,null,null,null,null,"E.  PROGRAMS AND SERVICES FOR ELs AND THEIR FAMILIES (CONTINUED)",null,null,null,null,null,null,null,null,null,null,null,null,null,null,null,"E.  PROGRAMS AND SERVICES FOR ELs AND THEIR FAMILIES (CONTINUED)",null,null,null,null,null,null,null,null,null,null,null,null,null,null,null,"E.  PROGRAMS AND SERVICES FOR ELs AND THEIR FAMILIES (CONTINUED)",null,null,null,null,null,null,null,null,null,null,null,null,null,null,null,"E.  PROGRAMS AND SERVICES FOR ELs AND THEIR FAMILIES (CONTINUED)",null,null,null,null,null,null,null,null,null,null,null,null,null,null,null,"E.  PROGRAMS AND SERVICES FOR ELs AND THEIR FAMILIES (CONTINUED)",null,null,null,null,null,null,null,null,null,null,null,null,null,null,null,"E.  PROGRAMS AND SERVICES FOR ELs AND THEIR FAMILIES (CONTINUED)",null,null,null,null,null,null,null,null,null,null,null,null,null,null,null,"E.  PROGRAMS AND SERVICES FOR ELs AND THEIR FAMILIES (CONTINUED)",null,null,null,null,null,null,null,null,null,null,null,null,null,null,null,"E.  PROGRAMS AND SERVICES FOR ELs AND THEIR FAMILIES (CONTINUED)",null,null,null,null,null,null,null,null,null,null,null,null,null,null,null,"E.  PROGRAMS AND SERVICES FOR ELs AND THEIR FAMILIES (CONTINUED)",null,null,null,null,null,null,null,null,null,null,null,null,null,null,null,"E.  PROGRAMS AND SERVICES FOR ELs AND THEIR FAMILIES (CONTINUED)",null,null,null,null,null,null,null,null,null,null,null,null,null,null,null,"E.  PROGRAMS AND SERVICES FOR ELs AND THEIR FAMILIES (CONTINUED)",null,null,null,null,null,null,null,null,null,null,null,null,null,null,null,"E.  PROGRAMS AND SERVICES FOR ELs AND THEIR FAMILIES (CONTINUED)",null,null,null,null,null,null,null,null,null,null,null,null,null,null,null,"E.  PROGRAMS AND SERVICES FOR ELs AND THEIR FAMILIES (CONTINUED)",null,null,null,null,null,null,null,null,null,null,null,null,null,null,null,"E.  PROGRAMS AND SERVICES FOR ELs AND THEIR FAMILIES (CONTINUED)",null,null,null,null,null,null,null,null,null,null,null,null,null,null,null,"E.  PROGRAMS AND SERVICES FOR ELs AND THEIR FAMILIES (CONTINUED)",null,null,null,null,null,null,null,null,null,null,null,null,null,null,null,"E.  PROGRAMS AND SERVICES FOR ELs AND THEIR FAMILIES (CONTINUED)",null,null,null,null,null,null,null,null,null,null,null,null,null,null,null,"E.  PROGRAMS AND SERVICES FOR ELs AND THEIR FAMILIES (CONTINUED)",null,null,null,null,null,null,null,null,null,null,null,null,null,null,null,"E.  PROGRAMS AND SERVICES FOR ELs AND THEIR FAMILIES (CONTINUED)",null,null,null,null,null,null,null,null,null,null,null,null,null,null,null,"E.  PROGRAMS AND SERVICES FOR ELs AND THEIR FAMILIES (CONTINUED)",null,null,null,null,null,null,null,null,null,null,null,null,null,null,null,"E.  PROGRAMS AND SERVICES FOR ELs AND THEIR FAMILIES (CONTINUED)",null,null,null,null,null,null,null,null,null,null,null,null,null,null,null,"E.  PROGRAMS AND SERVICES FOR ELs AND THEIR FAMILIES (CONTINUED)",null,null,null,null,null,null,null,null,null,null,null,null,null,null,null,"E.  PROGRAMS AND SERVICES FOR ELs AND THEIR FAMILIES (CONTINUED)",null,null,null,null,null,null,null,null,null,null,null,null,null,null,null,"E.  PROGRAMS AND SERVICES FOR ELs AND THEIR FAMILIES (CONTINUED)",null,null,null,null,null,null,null,null,null,null,null,null,null,null,null,"E.  PROGRAMS AND SERVICES FOR ELs AND THEIR FAMILIES (CONTINUED)",null,null,null,null,null,null,null,null,null,null,null,null,null,null,null,"E.  PROGRAMS AND SERVICES FOR ELs AND THEIR FAMILIES (CONTINUED)",null,null,null,null,null,null,null,null,null,null,null,null,null,null,null,"E.  PROGRAMS AND SERVICES FOR ELs AND THEIR FAMILIES (CONTINUED)",null,null,null,null,null,null,null,null,null,null,null,null,null,null,null,"E.  PROGRAMS AND SERVICES FOR ELs AND THEIR FAMILIES (CONTINUED)",null,null,null,null,null,null,null,null,null,null,null,null,null,null,null,"E.  PROGRAMS AND SERVICES FOR ELs AND THEIR FAMILIES (CONTINUED)",null,null,null,null,null,null,null,null,null,null,null,null,null,null,null,"E.  PROGRAMS AND SERVICES FOR ELs AND THEIR FAMILIES (CONTINUED)",null,null,null,null,null,null,null,null,null,null,null,null,null,null,null,"E.  PROGRAMS AND SERVICES FOR ELs AND THEIR FAMILIES (CONTINUED)",null,null,null,null,null,null,null,null,null,null,null,null,null,null,null,"E.  PROGRAMS AND SERVICES FOR ELs AND THEIR FAMILIES (CONTINUED)",null,null,null,null,null,null,null,null,null,null,null,null,null,null,null,"E.  PROGRAMS AND SERVICES FOR ELs AND THEIR FAMILIES (CONTINUED)",null,null,null,null,null,null,null,null,null,null,null,null,null,null,null,"E.  PROGRAMS AND SERVICES FOR ELs AND THEIR FAMILIES (CONTINUED)",null,null,null,null,null,null,null,null,null,null,null,null,null,null,null,"E.  PROGRAMS AND SERVICES FOR ELs AND THEIR FAMILIES (CONTINUED)",null,null,null,null,null,null,null,null,null,null,null,null,null,null,null,"E.  PROGRAMS AND SERVICES FOR ELs AND THEIR FAMILIES (CONTINUED)",null,null,null,null,null,null,null,null,null,null,null,null,null,null,null,"E.  PROGRAMS AND SERVICES FOR ELs AND THEIR FAMILIES (CONTINUED)",null,null,null,null,null,null,null,null,null,null,null,null,null,null,null,"E.  PROGRAMS AND SERVICES FOR ELs AND THEIR FAMILIES (CONTINUED)",null,null,null,null,null,null,null,null,null,null,null,null,null,null,null,"E.  PROGRAMS AND SERVICES FOR ELs AND THEIR FAMILIES (CONTINUED)",null,null,null,null,null,null,null,null,null,null,null,null,null,null,null,"E.  PROGRAMS AND SERVICES FOR ELs AND THEIR FAMILIES (CONTINUED)",null,null,null,null,null,null,null,null,null,null,null,null,null,null,null,"E.  PROGRAMS AND SERVICES FOR ELs AND THEIR FAMILIES (CONTINUED)",null,null,null,null,null,null,null,null,null,null,null,null,null,null,null,"E.  PROGRAMS AND SERVICES FOR ELs AND THEIR FAMILIES (CONTINUED)",null,null,null,null,null,null,null,null,null,null,null,null,null,null,null,"E.  PROGRAMS AND SERVICES FOR ELs AND THEIR FAMILIES (CONTINUED)",null,null,null,null,null,null,null,null,null,null,null,null,null,null,null,"E.  PROGRAMS AND SERVICES FOR ELs AND THEIR FAMILIES (CONTINUED)",null,null,null,null,null,null,null,null,null,null,null,null,null,null,null,"E.  PROGRAMS AND SERVICES FOR ELs AND THEIR FAMILIES (CONTINUED)",null,null,null,null,null,null,null,null,null,null,null,null,null,null,null,"E.  PROGRAMS AND SERVICES FOR ELs AND THEIR FAMILIES (CONTINUED)",null,null,null,null,null,null,null,null,null,null,null,null,null,null,null,"E.  PROGRAMS AND SERVICES FOR ELs AND THEIR FAMILIES (CONTINUED)",null,null,null,null,null,null,null,null,null,null,null,null,null,null,null,"E.  PROGRAMS AND SERVICES FOR ELs AND THEIR FAMILIES (CONTINUED)",null,null,null,null,null,null,null,null,null,null,null,null,null,null,null,"E.  PROGRAMS AND SERVICES FOR ELs AND THEIR FAMILIES (CONTINUED)",null,null,null,null,null,null,null,null,null,null,null,null,null,null,null,"E.  PROGRAMS AND SERVICES FOR ELs AND THEIR FAMILIES (CONTINUED)",null,null,null,null,null,null,null,null,null,null,null,null,null,null,null,"E.  PROGRAMS AND SERVICES FOR ELs AND THEIR FAMILIES (CONTINUED)",null,null,null,null,null,null,null,null,null,null,null,null,null,null,null,"E.  PROGRAMS AND SERVICES FOR ELs AND THEIR FAMILIES (CONTINUED)",null,null,null,null,null,null,null,null,null,null,null,null,null,null,null,"E.  PROGRAMS AND SERVICES FOR ELs AND THEIR FAMILIES (CONTINUED)",null,null,null,null,null,null,null,null,null,null,null,null,null,null,null,"E.  PROGRAMS AND SERVICES FOR ELs AND THEIR FAMILIES (CONTINUED)",null,null,null,null,null,null,null,null,null,null,null,null,null,null,null,"E.  PROGRAMS AND SERVICES FOR ELs AND THEIR FAMILIES (CONTINUED)",null,null,null,null,null,null,null,null,null,null,null,null,null,null,null,"E.  PROGRAMS AND SERVICES FOR ELs AND THEIR FAMILIES (CONTINUED)",null,null,null,null,null,null,null,null,null,null,null,null,null,null,null,"E.  PROGRAMS AND SERVICES FOR ELs AND THEIR FAMILIES (CONTINUED)",null,null,null,null,null,null,null,null,null,null,null,null,null,null,null,"E.  PROGRAMS AND SERVICES FOR ELs AND THEIR FAMILIES (CONTINUED)",null,null,null,null,null,null,null,null,null,null,null,null,null,null,null,"E.  PROGRAMS AND SERVICES FOR ELs AND THEIR FAMILIES (CONTINUED)",null,null,null,null,null,null,null,null,null,null,null,null,null,null,null,"E.  PROGRAMS AND SERVICES FOR ELs AND THEIR FAMILIES (CONTINUED)",null,null,null,null,null,null,null,null,null,null,null,null,null,null,null,"E.  PROGRAMS AND SERVICES FOR ELs AND THEIR FAMILIES (CONTINUED)",null,null,null,null,null,null,null,null,null,null,null,null,null,null,null,"E.  PROGRAMS AND SERVICES FOR ELs AND THEIR FAMILIES (CONTINUED)",null,null,null,null,null,null,null,null,null,null,null,null,null,null,null,"E.  PROGRAMS AND SERVICES FOR ELs AND THEIR FAMILIES (CONTINUED)",null,null,null,null,null,null,null,null,null,null,null,null,null,null,null,"E.  PROGRAMS AND SERVICES FOR ELs AND THEIR FAMILIES (CONTINUED)",null,null,null,null,null,null,null,null,null,null,null,null,null,null,null,"E.  PROGRAMS AND SERVICES FOR ELs AND THEIR FAMILIES (CONTINUED)",null,null,null,null,null,null,null,null,null,null,null,null,null,null,null,"E.  PROGRAMS AND SERVICES FOR ELs AND THEIR FAMILIES (CONTINUED)",null,null,null,null,null,null,null,null,null,null,null,null,null,null,null,"E.  PROGRAMS AND SERVICES FOR ELs AND THEIR FAMILIES (CONTINUED)",null,null,null,null,null,null,null,null,null,null,null,null,null,null,null,"E.  PROGRAMS AND SERVICES FOR ELs AND THEIR FAMILIES (CONTINUED)",null,null,null,null,null,null,null,null,null,null,null,null,null,null,null,"E.  PROGRAMS AND SERVICES FOR ELs AND THEIR FAMILIES (CONTINUED)",null,null,null,null,null,null,null,null,null,null,null,null,null,null,null,"E.  PROGRAMS AND SERVICES FOR ELs AND THEIR FAMILIES (CONTINUED)",null,null,null,null,null,null,null,null,null,null,null,null,null,null,null,"E.  PROGRAMS AND SERVICES FOR ELs AND THEIR FAMILIES (CONTINUED)",null,null,null,null,null,null,null,null,null,null,null,null,null,null,null,"E.  PROGRAMS AND SERVICES FOR ELs AND THEIR FAMILIES (CONTINUED)",null,null,null,null,null,null,null,null,null,null,null,null,null,null,null,"E.  PROGRAMS AND SERVICES FOR ELs AND THEIR FAMILIES (CONTINUED)",null,null,null,null,null,null,null,null,null,null,null,null,null,null,null,"E.  PROGRAMS AND SERVICES FOR ELs AND THEIR FAMILIES (CONTINUED)",null,null,null,null,null,null,null,null,null,null,null,null,null,null,null,"E.  PROGRAMS AND SERVICES FOR ELs AND THEIR FAMILIES (CONTINUED)",null,null,null,null,null,null,null,null,null,null,null,null,null,null,null,"E.  PROGRAMS AND SERVICES FOR ELs AND THEIR FAMILIES (CONTINUED)",null,null,null,null,null,null,null,null,null,null,null,null,null,null,null,"E.  PROGRAMS AND SERVICES FOR ELs AND THEIR FAMILIES (CONTINUED)",null,null,null,null,null,null,null,null,null,null,null,null,null,null,null,"E.  PROGRAMS AND SERVICES FOR ELs AND THEIR FAMILIES (CONTINUED)",null,null,null,null,null,null,null,null,null,null,null,null,null,null,null,"E.  PROGRAMS AND SERVICES FOR ELs AND THEIR FAMILIES (CONTINUED)",null,null,null,null,null,null,null,null,null,null,null,null,null,null,null,"E.  PROGRAMS AND SERVICES FOR ELs AND THEIR FAMILIES (CONTINUED)",null,null,null,null,null,null,null,null,null,null,null,null,null,null,null,"E.  PROGRAMS AND SERVICES FOR ELs AND THEIR FAMILIES (CONTINUED)",null,null,null,null,null,null,null,null,null,null,null,null,null,null,null,"E.  PROGRAMS AND SERVICES FOR ELs AND THEIR FAMILIES (CONTINUED)",null,null,null,null,null,null,null,null,null,null,null,null,null,null,null,"E.  PROGRAMS AND SERVICES FOR ELs AND THEIR FAMILIES (CONTINUED)",null,null,null,null,null,null,null,null,null,null,null,null,null,null,null,"E.  PROGRAMS AND SERVICES FOR ELs AND THEIR FAMILIES (CONTINUED)",null,null,null,null,null,null,null,null,null,null,null,null,null,null,null,"E.  PROGRAMS AND SERVICES FOR ELs AND THEIR FAMILIES (CONTINUED)",null,null,null,null,null,null,null,null,null,null,null,null,null,null,null,"E.  PROGRAMS AND SERVICES FOR ELs AND THEIR FAMILIES (CONTINUED)",null,null,null,null,null,null,null,null,null,null,null,null,null,null,null,"E.  PROGRAMS AND SERVICES FOR ELs AND THEIR FAMILIES (CONTINUED)",null,null,null,null,null,null,null,null,null,null,null,null,null,null,null,"E.  PROGRAMS AND SERVICES FOR ELs AND THEIR FAMILIES (CONTINUED)",null,null,null,null,null,null,null,null,null,null,null,null,null,null,null,"E.  PROGRAMS AND SERVICES FOR ELs AND THEIR FAMILIES (CONTINUED)",null,null,null,null,null,null,null,null,null,null,null,null,null,null,null,"E.  PROGRAMS AND SERVICES FOR ELs AND THEIR FAMILIES (CONTINUED)",null,null,null,null,null,null,null,null,null,null,null,null,null,null,null,"E.  PROGRAMS AND SERVICES FOR ELs AND THEIR FAMILIES (CONTINUED)",null,null,null,null,null,null,null,null,null,null,null,null,null,null,null,"E.  PROGRAMS AND SERVICES FOR ELs AND THEIR FAMILIES (CONTINUED)",null,null,null,null,null,null,null,null,null,null,null,null,null,null,null,"E.  PROGRAMS AND SERVICES FOR ELs AND THEIR FAMILIES (CONTINUED)",null,null,null,null,null,null,null,null,null,null,null,null,null,null,null,"E.  PROGRAMS AND SERVICES FOR ELs AND THEIR FAMILIES (CONTINUED)",null,null,null,null,null,null,null,null,null,null,null,null,null,null,null,"E.  PROGRAMS AND SERVICES FOR ELs AND THEIR FAMILIES (CONTINUED)",null,null,null,null,null,null,null,null,null,null,null,null,null,null,null,"E.  PROGRAMS AND SERVICES FOR ELs AND THEIR FAMILIES (CONTINUED)",null,null,null,null,null,null,null,null,null,null,null,null,null,null,null,"E.  PROGRAMS AND SERVICES FOR ELs AND THEIR FAMILIES (CONTINUED)",null,null,null,null,null,null,null,null,null,null,null,null,null,null,null,"E.  PROGRAMS AND SERVICES FOR ELs AND THEIR FAMILIES (CONTINUED)",null,null,null,null,null,null,null,null,null,null,null,null,null,null,null,"E.  PROGRAMS AND SERVICES FOR ELs AND THEIR FAMILIES (CONTINUED)",null,null,null,null,null,null,null,null,null,null,null,null,null,null,null,"E.  PROGRAMS AND SERVICES FOR ELs AND THEIR FAMILIES (CONTINUED)",null,null,null,null,null,null,null,null,null,null,null,null,null,null,null,"E.  PROGRAMS AND SERVICES FOR ELs AND THEIR FAMILIES (CONTINUED)",null,null,null,null,null,null,null,null,null,null,null,null,null,null,null,"E.  PROGRAMS AND SERVICES FOR ELs AND THEIR FAMILIES (CONTINUED)",null,null,null,null,null,null,null,null,null,null,null,null,null,null,null,"E.  PROGRAMS AND SERVICES FOR ELs AND THEIR FAMILIES (CONTINUED)",null,null,null,null,null,null,null,null,null,null,null,null,null,null,null,"E.  PROGRAMS AND SERVICES FOR ELs AND THEIR FAMILIES (CONTINUED)",null,null,null,null,null,null,null,null,null,null,null,null,null,null,null,"E.  PROGRAMS AND SERVICES FOR ELs AND THEIR FAMILIES (CONTINUED)",null,null,null,null,null,null,null,null,null,null,null,null,null,null,null,"E.  PROGRAMS AND SERVICES FOR ELs AND THEIR FAMILIES (CONTINUED)",null,null,null,null,null,null,null,null,null,null,null,null,null,null,null,"E.  PROGRAMS AND SERVICES FOR ELs AND THEIR FAMILIES (CONTINUED)",null,null,null,null,null,null,null,null,null,null,null,null,null,null,null,"E.  PROGRAMS AND SERVICES FOR ELs AND THEIR FAMILIES (CONTINUED)",null,null,null,null,null,null,null,null,null,null,null,null,null,null,null,"E.  PROGRAMS AND SERVICES FOR ELs AND THEIR FAMILIES (CONTINUED)",null,null,null,null,null,null,null,null,null,null,null,null,null,null,null,"E.  PROGRAMS AND SERVICES FOR ELs AND THEIR FAMILIES (CONTINUED)",null,null,null,null,null,null,null,null,null,null,null,null,null,null,null,"E.  PROGRAMS AND SERVICES FOR ELs AND THEIR FAMILIES (CONTINUED)",null,null,null,null,null,null,null,null,null,null,null,null,null,null,null,"E.  PROGRAMS AND SERVICES FOR ELs AND THEIR FAMILIES (CONTINUED)",null,null,null,null,null,null,null,null,null,null,null,null,null,null,null,"E.  PROGRAMS AND SERVICES FOR ELs AND THEIR FAMILIES (CONTINUED)",null,null,null,null,null,null,null,null,null,null,null,null,null,null,null,"E.  PROGRAMS AND SERVICES FOR ELs AND THEIR FAMILIES (CONTINUED)",null,null,null,null,null,null,null,null,null,null,null,null,null,null,null,"E.  PROGRAMS AND SERVICES FOR ELs AND THEIR FAMILIES (CONTINUED)",null,null,null,null,null,null,null,null,null,null,null,null,null,null,null,"E.  PROGRAMS AND SERVICES FOR ELs AND THEIR FAMILIES (CONTINUED)",null,null,null,null,null,null,null,null,null,null,null,null,null,null,null,"E.  PROGRAMS AND SERVICES FOR ELs AND THEIR FAMILIES (CONTINUED)",null,null,null,null,null,null,null,null,null,null,null,null,null,null,null,"E.  PROGRAMS AND SERVICES FOR ELs AND THEIR FAMILIES (CONTINUED)",null,null,null,null,null,null,null,null,null,null,null,null,null,null,null,"E.  PROGRAMS AND SERVICES FOR ELs AND THEIR FAMILIES (CONTINUED)",null,null,null,null,null,null,null,null,null,null,null,null,null,null,null,"E.  PROGRAMS AND SERVICES FOR ELs AND THEIR FAMILIES (CONTINUED)",null,null,null,null,null,null,null,null,null,null,null,null,null,null,null,"E.  PROGRAMS AND SERVICES FOR ELs AND THEIR FAMILIES (CONTINUED)",null,null,null,null,null,null,null,null,null,null,null,null,null,null,null,"E.  PROGRAMS AND SERVICES FOR ELs AND THEIR FAMILIES (CONTINUED)",null,null,null,null,null,null,null,null,null,null,null,null,null,null,null,"E.  PROGRAMS AND SERVICES FOR ELs AND THEIR FAMILIES (CONTINUED)",null,null,null,null,null,null,null,null,null,null,null,null,null,null,null,"E.  PROGRAMS AND SERVICES FOR ELs AND THEIR FAMILIES (CONTINUED)",null,null,null,null,null,null,null,null,null,null,null,null,null,null,null,"E.  PROGRAMS AND SERVICES FOR ELs AND THEIR FAMILIES (CONTINUED)",null,null,null,null,null,null,null,null,null,null,null,null,null,null,null,"E.  PROGRAMS AND SERVICES FOR ELs AND THEIR FAMILIES (CONTINUED)",null,null,null,null,null,null,null,null,null,null,null,null,null,null,null,"E.  PROGRAMS AND SERVICES FOR ELs AND THEIR FAMILIES (CONTINUED)",null,null,null,null,null,null,null,null,null,null,null,null,null,null,null,"E.  PROGRAMS AND SERVICES FOR ELs AND THEIR FAMILIES (CONTINUED)",null,null,null,null,null,null,null,null,null,null,null,null,null,null,null,"E.  PROGRAMS AND SERVICES FOR ELs AND THEIR FAMILIES (CONTINUED)",null,null,null,null,null,null,null,null,null,null,null,null,null,null,null,"E.  PROGRAMS AND SERVICES FOR ELs AND THEIR FAMILIES (CONTINUED)",null,null,null,null,null,null,null,null,null,null,null,null,null,null,null,"E.  PROGRAMS AND SERVICES FOR ELs AND THEIR FAMILIES (CONTINUED)",null,null,null,null,null,null,null,null,null,null,null,null,null,null,null,"E.  PROGRAMS AND SERVICES FOR ELs AND THEIR FAMILIES (CONTINUED)",null,null,null,null,null,null,null,null,null,null,null,null,null,null,null,"E.  PROGRAMS AND SERVICES FOR ELs AND THEIR FAMILIES (CONTINUED)",null,null,null,null,null,null,null,null,null,null,null,null,null,null,null,"E.  PROGRAMS AND SERVICES FOR ELs AND THEIR FAMILIES (CONTINUED)",null,null,null,null,null,null,null,null,null,null,null,null,null,null,null,"E.  PROGRAMS AND SERVICES FOR ELs AND THEIR FAMILIES (CONTINUED)",null,null,null,null,null,null,null,null,null,null,null,null,null,null,null,"E.  PROGRAMS AND SERVICES FOR ELs AND THEIR FAMILIES (CONTINUED)",null,null,null,null,null,null,null,null,null,null,null,null,null,null,null,"E.  PROGRAMS AND SERVICES FOR ELs AND THEIR FAMILIES (CONTINUED)",null,null,null,null,null,null,null,null,null,null,null,null,null,null,null,"E.  PROGRAMS AND SERVICES FOR ELs AND THEIR FAMILIES (CONTINUED)",null,null,null,null,null,null,null,null,null,null,null,null,null,null,null,"E.  PROGRAMS AND SERVICES FOR ELs AND THEIR FAMILIES (CONTINUED)",null,null,null,null,null,null,null,null,null,null,null,null,null,null,null,"E.  PROGRAMS AND SERVICES FOR ELs AND THEIR FAMILIES (CONTINUED)",null,null,null,null,null,null,null,null,null,null,null,null,null,null,null,"E.  PROGRAMS AND SERVICES FOR ELs AND THEIR FAMILIES (CONTINUED)",null,null,null,null,null,null,null,null,null,null,null,null,null,null,null,"E.  PROGRAMS AND SERVICES FOR ELs AND THEIR FAMILIES (CONTINUED)",null,null,null,null,null,null,null,null,null,null,null,null,null,null,null,"E.  PROGRAMS AND SERVICES FOR ELs AND THEIR FAMILIES (CONTINUED)",null,null,null,null,null,null,null,null,null,null,null,null,null,null,null,"E.  PROGRAMS AND SERVICES FOR ELs AND THEIR FAMILIES (CONTINUED)",null,null,null,null,null,null,null,null,null,null,null,null,null,null,null,"E.  PROGRAMS AND SERVICES FOR ELs AND THEIR FAMILIES (CONTINUED)",null,null,null,null,null,null,null,null,null,null,null,null,null,null,null,"E.  PROGRAMS AND SERVICES FOR ELs AND THEIR FAMILIES (CONTINUED)",null,null,null,null,null,null,null,null,null,null,null,null,null,null,null,"E.  PROGRAMS AND SERVICES FOR ELs AND THEIR FAMILIES (CONTINUED)",null,null,null,null,null,null,null,null,null,null,null,null,null,null,null,"E.  PROGRAMS AND SERVICES FOR ELs AND THEIR FAMILIES (CONTINUED)",null,null,null,null,null,null,null,null,null,null,null,null,null,null,null,"E.  PROGRAMS AND SERVICES FOR ELs AND THEIR FAMILIES (CONTINUED)",null,null,null,null,null,null,null,null,null,null,null,null,null,null,null,"E.  PROGRAMS AND SERVICES FOR ELs AND THEIR FAMILIES (CONTINUED)",null,null,null,null,null,null,null,null,null,null,null,null,null,null,null,"E.  PROGRAMS AND SERVICES FOR ELs AND THEIR FAMILIES (CONTINUED)",null,null,null,null,null,null,null,null,null,null,null,null,null,null,null,"E.  PROGRAMS AND SERVICES FOR ELs AND THEIR FAMILIES (CONTINUED)",null,null,null,null,null,null,null,null,null,null,null,null,null,null,null,"E.  PROGRAMS AND SERVICES FOR ELs AND THEIR FAMILIES (CONTINUED)",null,null,null,null,null,null,null,null,null,null,null,null,null,null,null,"E.  PROGRAMS AND SERVICES FOR ELs AND THEIR FAMILIES (CONTINUED)",null,null,null,null,null,null,null,null,null,null,null,null,null,null,null,"E.  PROGRAMS AND SERVICES FOR ELs AND THEIR FAMILIES (CONTINUED)",null,null,null,null,null,null,null,null,null,null,null,null,null,null,null,"E.  PROGRAMS AND SERVICES FOR ELs AND THEIR FAMILIES (CONTINUED)",null,null,null,null,null,null,null,null,null,null,null,null,null,null,null,"E.  PROGRAMS AND SERVICES FOR ELs AND THEIR FAMILIES (CONTINUED)",null,null,null,null,null,null,null,null,null,null,null,null,null,null,null,"E.  PROGRAMS AND SERVICES FOR ELs AND THEIR FAMILIES (CONTINUED)",null,null,null,null,null,null,null,null,null,null,null,null,null,null,null,"E.  PROGRAMS AND SERVICES FOR ELs AND THEIR FAMILIES (CONTINUED)",null,null,null,null,null,null,null,null,null,null,null,null,null,null,null,"E.  PROGRAMS AND SERVICES FOR ELs AND THEIR FAMILIES (CONTINUED)",null,null,null,null,null,null,null,null,null,null,null,null,null,null,null,"E.  PROGRAMS AND SERVICES FOR ELs AND THEIR FAMILIES (CONTINUED)",null,null,null,null,null,null,null,null,null,null,null,null,null,null,null,"E.  PROGRAMS AND SERVICES FOR ELs AND THEIR FAMILIES (CONTINUED)",null,null,null,null,null,null,null,null,null,null,null,null,null,null,null,"E.  PROGRAMS AND SERVICES FOR ELs AND THEIR FAMILIES (CONTINUED)",null,null,null,null,null,null,null,null,null,null,null,null,null,null,null,"E.  PROGRAMS AND SERVICES FOR ELs AND THEIR FAMILIES (CONTINUED)",null,null,null,null,null,null,null,null,null,null,null,null,null,null,null,"E.  PROGRAMS AND SERVICES FOR ELs AND THEIR FAMILIES (CONTINUED)",null,null,null,null,null,null,null,null,null,null,null,null,null,null,null,"E.  PROGRAMS AND SERVICES FOR ELs AND THEIR FAMILIES (CONTINUED)",null,null,null,null,null,null,null,null,null,null,null,null,null,null,null,"E.  PROGRAMS AND SERVICES FOR ELs AND THEIR FAMILIES (CONTINUED)",null,null,null,null,null,null,null,null,null,null,null,null,null,null,null,"E.  PROGRAMS AND SERVICES FOR ELs AND THEIR FAMILIES (CONTINUED)",null,null,null,null,null,null,null,null,null,null,null,null,null,null,null,"E.  PROGRAMS AND SERVICES FOR ELs AND THEIR FAMILIES (CONTINUED)",null,null,null,null,null,null,null,null,null,null,null,null,null,null,null,"E.  PROGRAMS AND SERVICES FOR ELs AND THEIR FAMILIES (CONTINUED)",null,null,null,null,null,null,null,null,null,null,null,null,null,null,null,"E.  PROGRAMS AND SERVICES FOR ELs AND THEIR FAMILIES (CONTINUED)",null,null,null,null,null,null,null,null,null,null,null,null,null,null,null,"E.  PROGRAMS AND SERVICES FOR ELs AND THEIR FAMILIES (CONTINUED)",null,null,null,null,null,null,null,null,null,null,null,null,null,null,null,"E.  PROGRAMS AND SERVICES FOR ELs AND THEIR FAMILIES (CONTINUED)",null,null,null,null,null,null,null,null,null,null,null,null,null,null,null,"E.  PROGRAMS AND SERVICES FOR ELs AND THEIR FAMILIES (CONTINUED)",null,null,null,null,null,null,null,null,null,null,null,null,null,null,null,"E.  PROGRAMS AND SERVICES FOR ELs AND THEIR FAMILIES (CONTINUED)",null,null,null,null,null,null,null,null,null,null,null,null,null,null,null,"E.  PROGRAMS AND SERVICES FOR ELs AND THEIR FAMILIES (CONTINUED)",null,null,null,null,null,null,null,null,null,null,null,null,null,null,null,"E.  PROGRAMS AND SERVICES FOR ELs AND THEIR FAMILIES (CONTINUED)",null,null,null,null,null,null,null,null,null,null,null,null,null,null,null,"E.  PROGRAMS AND SERVICES FOR ELs AND THEIR FAMILIES (CONTINUED)",null,null,null,null,null,null,null,null,null,null,null,null,null,null,null,"E.  PROGRAMS AND SERVICES FOR ELs AND THEIR FAMILIES (CONTINUED)",null,null,null,null,null,null,null,null,null,null,null,null,null,null,null,"E.  PROGRAMS AND SERVICES FOR ELs AND THEIR FAMILIES (CONTINUED)",null,null,null,null,null,null,null,null,null,null,null,null,null,null,null,"E.  PROGRAMS AND SERVICES FOR ELs AND THEIR FAMILIES (CONTINUED)",null,null,null,null,null,null,null,null,null,null,null,null,null,null,null,"E.  PROGRAMS AND SERVICES FOR ELs AND THEIR FAMILIES (CONTINUED)",null,null,null,null,null,null,null,null,null,null,null,null,null,null,null,"E.  PROGRAMS AND SERVICES FOR ELs AND THEIR FAMILIES (CONTINUED)",null,null,null,null,null,null,null,null,null,null,null,null,null,null,null,"E.  PROGRAMS AND SERVICES FOR ELs AND THEIR FAMILIES (CONTINUED)",null,null,null,null,null,null,null,null,null,null,null,null,null,null,null,"E.  PROGRAMS AND SERVICES FOR ELs AND THEIR FAMILIES (CONTINUED)",null,null,null,null,null,null,null,null,null,null,null,null,null,null,null,"E.  PROGRAMS AND SERVICES FOR ELs AND THEIR FAMILIES (CONTINUED)",null,null,null,null,null,null,null,null,null,null,null,null,null,null,null,"E.  PROGRAMS AND SERVICES FOR ELs AND THEIR FAMILIES (CONTINUED)",null,null,null,null,null,null,null,null,null,null,null,null,null,null,null,"E.  PROGRAMS AND SERVICES FOR ELs AND THEIR FAMILIES (CONTINUED)",null,null,null,null,null,null,null,null,null,null,null,null,null,null,null,"E.  PROGRAMS AND SERVICES FOR ELs AND THEIR FAMILIES (CONTINUED)",null,null,null,null,null,null,null,null,null,null,null,null,null,null,null,"E.  PROGRAMS AND SERVICES FOR ELs AND THEIR FAMILIES (CONTINUED)",null,null,null,null,null,null,null,null,null,null,null,null,null,null,null,"E.  PROGRAMS AND SERVICES FOR ELs AND THEIR FAMILIES (CONTINUED)",null,null,null,null,null,null,null,null,null,null,null,null,null,null,null,"E.  PROGRAMS AND SERVICES FOR ELs AND THEIR FAMILIES (CONTINUED)",null,null,null,null,null,null,null,null,null,null,null,null,null,null,null,"E.  PROGRAMS AND SERVICES FOR ELs AND THEIR FAMILIES (CONTINUED)",null,null,null,null,null,null,null,null,null,null,null,null,null,null,null,"E.  PROGRAMS AND SERVICES FOR ELs AND THEIR FAMILIES (CONTINUED)",null,null,null,null,null,null,null,null,null,null,null,null,null,null,null,"E.  PROGRAMS AND SERVICES FOR ELs AND THEIR FAMILIES (CONTINUED)",null,null,null,null,null,null,null,null,null,null,null,null,null,null,null,"E.  PROGRAMS AND SERVICES FOR ELs AND THEIR FAMILIES (CONTINUED)",null,null,null,null,null,null,null,null,null,null,null,null,null,null,null,"E.  PROGRAMS AND SERVICES FOR ELs AND THEIR FAMILIES (CONTINUED)",null,null,null,null,null,null,null,null,null,null,null,null,null,null,null,"E.  PROGRAMS AND SERVICES FOR ELs AND THEIR FAMILIES (CONTINUED)",null,null,null,null,null,null,null,null,null,null,null,null,null,null,null,"E.  PROGRAMS AND SERVICES FOR ELs AND THEIR FAMILIES (CONTINUED)",null,null,null,null,null,null,null,null,null,null,null,null,null,null,null,"E.  PROGRAMS AND SERVICES FOR ELs AND THEIR FAMILIES (CONTINUED)",null,null,null,null,null,null,null,null,null,null,null,null,null,null,null,"E.  PROGRAMS AND SERVICES FOR ELs AND THEIR FAMILIES (CONTINUED)",null,null,null,null,null,null,null,null,null,null,null,null,null,null,null,"E.  PROGRAMS AND SERVICES FOR ELs AND THEIR FAMILIES (CONTINUED)",null,null,null,null,null,null,null,null,null,null,null,null,null,null,null,"E.  PROGRAMS AND SERVICES FOR ELs AND THEIR FAMILIES (CONTINUED)",null,null,null,null,null,null,null,null,null,null,null,null,null,null,null,"E.  PROGRAMS AND SERVICES FOR ELs AND THEIR FAMILIES (CONTINUED)",null,null,null,null,null,null,null,null,null,null,null,null,null,null,null,"E.  PROGRAMS AND SERVICES FOR ELs AND THEIR FAMILIES (CONTINUED)",null,null,null,null,null,null,null,null,null,null,null,null,null,null,null,"E.  PROGRAMS AND SERVICES FOR ELs AND THEIR FAMILIES (CONTINUED)",null,null,null,null,null,null,null,null,null,null,null,null,null,null,null,"E.  PROGRAMS AND SERVICES FOR ELs AND THEIR FAMILIES (CONTINUED)",null,null,null,null,null,null,null,null,null,null,null,null,null,null,null,"E.  PROGRAMS AND SERVICES FOR ELs AND THEIR FAMILIES (CONTINUED)",null,null,null,null,null,null,null,null,null,null,null,null,null,null,null,"E.  PROGRAMS AND SERVICES FOR ELs AND THEIR FAMILIES (CONTINUED)",null,null,null,null,null,null,null,null,null,null,null,null,null,null,null,"E.  PROGRAMS AND SERVICES FOR ELs AND THEIR FAMILIES (CONTINUED)",null,null,null,null,null,null,null,null,null,null,null,null,null,null,null,"E.  PROGRAMS AND SERVICES FOR ELs AND THEIR FAMILIES (CONTINUED)",null,null,null,null,null,null,null,null,null,null,null,null,null,null,null,"E.  PROGRAMS AND SERVICES FOR ELs AND THEIR FAMILIES (CONTINUED)",null,null,null,null,null,null,null,null,null,null,null,null,null,null,null,"E.  PROGRAMS AND SERVICES FOR ELs AND THEIR FAMILIES (CONTINUED)",null,null,null,null,null,null,null,null,null,null,null,null,null,null,null,"E.  PROGRAMS AND SERVICES FOR ELs AND THEIR FAMILIES (CONTINUED)",null,null,null,null,null,null,null,null,null,null,null,null,null,null,null,"E.  PROGRAMS AND SERVICES FOR ELs AND THEIR FAMILIES (CONTINUED)",null,null,null,null,null,null,null,null,null,null,null,null,null,null,null,"E.  PROGRAMS AND SERVICES FOR ELs AND THEIR FAMILIES (CONTINUED)",null,null,null,null,null,null,null,null,null,null,null,null,null,null,null,"E.  PROGRAMS AND SERVICES FOR ELs AND THEIR FAMILIES (CONTINUED)",null,null,null,null,null,null,null,null,null,null,null,null,null,null,null,"E.  PROGRAMS AND SERVICES FOR ELs AND THEIR FAMILIES (CONTINUED)",null,null,null,null,null,null,null,null,null,null,null,null,null,null,null,"E.  PROGRAMS AND SERVICES FOR ELs AND THEIR FAMILIES (CONTINUED)",null,null,null,null,null,null,null,null,null,null,null,null,null,null,null,"E.  PROGRAMS AND SERVICES FOR ELs AND THEIR FAMILIES (CONTINUED)",null,null,null,null,null,null,null,null,null,null,null,null,null,null,null,"E.  PROGRAMS AND SERVICES FOR ELs AND THEIR FAMILIES (CONTINUED)",null,null,null,null,null,null,null,null,null,null,null,null,null,null,null,"E.  PROGRAMS AND SERVICES FOR ELs AND THEIR FAMILIES (CONTINUED)",null,null,null,null,null,null,null,null,null,null,null,null,null,null,null,"E.  PROGRAMS AND SERVICES FOR ELs AND THEIR FAMILIES (CONTINUED)",null,null,null,null,null,null,null,null,null,null,null,null,null,null,null,"E.  PROGRAMS AND SERVICES FOR ELs AND THEIR FAMILIES (CONTINUED)",null,null,null,null,null,null,null,null,null,null,null,null,null,null,null,"E.  PROGRAMS AND SERVICES FOR ELs AND THEIR FAMILIES (CONTINUED)",null,null,null,null,null,null,null,null,null,null,null,null,null,null,null,"E.  PROGRAMS AND SERVICES FOR ELs AND THEIR FAMILIES (CONTINUED)",null,null,null,null,null,null,null,null,null,null,null,null,null,null,null,"E.  PROGRAMS AND SERVICES FOR ELs AND THEIR FAMILIES (CONTINUED)",null,null,null,null,null,null,null,null,null,null,null,null,null,null,null,"E.  PROGRAMS AND SERVICES FOR ELs AND THEIR FAMILIES (CONTINUED)",null,null,null,null,null,null,null,null,null,null,null,null,null,null,null,"E.  PROGRAMS AND SERVICES FOR ELs AND THEIR FAMILIES (CONTINUED)",null,null,null,null,null,null,null,null,null,null,null,null,null,null,null,"E.  PROGRAMS AND SERVICES FOR ELs AND THEIR FAMILIES (CONTINUED)",null,null,null,null,null,null,null,null,null,null,null,null,null,null,null,"E.  PROGRAMS AND SERVICES FOR ELs AND THEIR FAMILIES (CONTINUED)",null,null,null,null,null,null,null,null,null,null,null,null,null,null,null,"E.  PROGRAMS AND SERVICES FOR ELs AND THEIR FAMILIES (CONTINUED)",null,null,null,null,null,null,null,null,null,null,null,null,null,null,null,"E.  PROGRAMS AND SERVICES FOR ELs AND THEIR FAMILIES (CONTINUED)",null,null,null,null,null,null,null,null,null,null,null,null,null,null,null,"E.  PROGRAMS AND SERVICES FOR ELs AND THEIR FAMILIES (CONTINUED)",null,null,null,null,null,null,null,null,null,null,null,null,null,null,null,"E.  PROGRAMS AND SERVICES FOR ELs AND THEIR FAMILIES (CONTINUED)",null,null,null,null,null,null,null,null,null,null,null,null,null,null,null,"E.  PROGRAMS AND SERVICES FOR ELs AND THEIR FAMILIES (CONTINUED)",null,null,null,null,null,null,null,null,null,null,null,null,null,null,null,"E.  PROGRAMS AND SERVICES FOR ELs AND THEIR FAMILIES (CONTINUED)",null,null,null,null,null,null,null,null,null,null,null,null,null,null,null,"E.  PROGRAMS AND SERVICES FOR ELs AND THEIR FAMILIES (CONTINUED)",null,null,null,null,null,null,null,null,null,null,null,null,null,null,null,"E.  PROGRAMS AND SERVICES FOR ELs AND THEIR FAMILIES (CONTINUED)",null,null,null,null,null,null,null,null,null,null,null,null,null,null,null,"E.  PROGRAMS AND SERVICES FOR ELs AND THEIR FAMILIES (CONTINUED)",null,null,null,null,null,null,null,null,null,null,null,null,null,null,null,"E.  PROGRAMS AND SERVICES FOR ELs AND THEIR FAMILIES (CONTINUED)",null,null,null,null,null,null,null,null,null,null,null,null,null,null,null,"E.  PROGRAMS AND SERVICES FOR ELs AND THEIR FAMILIES (CONTINUED)",null,null,null,null,null,null,null,null,null,null,null,null,null,null,null,"E.  PROGRAMS AND SERVICES FOR ELs AND THEIR FAMILIES (CONTINUED)",null,null,null,null,null,null,null,null,null,null,null,null,null,null,null,"E.  PROGRAMS AND SERVICES FOR ELs AND THEIR FAMILIES (CONTINUED)",null,null,null,null,null,null,null,null,null,null,null,null,null,null,null,"E.  PROGRAMS AND SERVICES FOR ELs AND THEIR FAMILIES (CONTINUED)",null,null,null,null,null,null,null,null,null,null,null,null,null,null,null,"E.  PROGRAMS AND SERVICES FOR ELs AND THEIR FAMILIES (CONTINUED)",null,null,null,null,null,null,null,null,null,null,null,null,null,null,null,"E.  PROGRAMS AND SERVICES FOR ELs AND THEIR FAMILIES (CONTINUED)",null,null,null,null,null,null,null,null,null,null,null,null,null,null,null,"E.  PROGRAMS AND SERVICES FOR ELs AND THEIR FAMILIES (CONTINUED)",null,null,null,null,null,null,null,null,null,null,null,null,null,null,null,"E.  PROGRAMS AND SERVICES FOR ELs AND THEIR FAMILIES (CONTINUED)",null,null,null,null,null,null,null,null,null,null,null,null,null,null,null,"E.  PROGRAMS AND SERVICES FOR ELs AND THEIR FAMILIES (CONTINUED)",null,null,null,null,null,null,null,null,null,null,null,null,null,null,null,"E.  PROGRAMS AND SERVICES FOR ELs AND THEIR FAMILIES (CONTINUED)",null,null,null,null,null,null,null,null,null,null,null,null,null,null,null,"E.  PROGRAMS AND SERVICES FOR ELs AND THEIR FAMILIES (CONTINUED)",null,null,null,null,null,null,null,null,null,null,null,null,null,null,null,"E.  PROGRAMS AND SERVICES FOR ELs AND THEIR FAMILIES (CONTINUED)",null,null,null,null,null,null,null,null,null,null,null,null,null,null,null,"E.  PROGRAMS AND SERVICES FOR ELs AND THEIR FAMILIES (CONTINUED)",null,null,null,null,null,null,null,null,null,null,null,null,null,null,null,"E.  PROGRAMS AND SERVICES FOR ELs AND THEIR FAMILIES (CONTINUED)",null,null,null,null,null,null,null,null,null,null,null,null,null,null,null,"E.  PROGRAMS AND SERVICES FOR ELs AND THEIR FAMILIES (CONTINUED)",null,null,null,null,null,null,null,null,null,null,null,null,null,null,null,"E.  PROGRAMS AND SERVICES FOR ELs AND THEIR FAMILIES (CONTINUED)",null,null,null,null,null,null,null,null,null,null,null,null,null,null,null,"E.  PROGRAMS AND SERVICES FOR ELs AND THEIR FAMILIES (CONTINUED)",null,null,null,null,null,null,null,null,null,null,null,null,null,null,null,"E.  PROGRAMS AND SERVICES FOR ELs AND THEIR FAMILIES (CONTINUED)",null,null,null,null,null,null,null,null,null,null,null,null,null,null,null,"E.  PROGRAMS AND SERVICES FOR ELs AND THEIR FAMILIES (CONTINUED)",null,null,null,null,null,null,null,null,null,null,null,null,null,null,null,"E.  PROGRAMS AND SERVICES FOR ELs AND THEIR FAMILIES (CONTINUED)",null,null,null,null,null,null,null,null,null,null,null,null,null,null,null,"E.  PROGRAMS AND SERVICES FOR ELs AND THEIR FAMILIES (CONTINUED)",null,null,null,null,null,null,null,null,null,null,null,null,null,null,null,"E.  PROGRAMS AND SERVICES FOR ELs AND THEIR FAMILIES (CONTINUED)",null,null,null,null,null,null,null,null,null,null,null,null,null,null,null,"E.  PROGRAMS AND SERVICES FOR ELs AND THEIR FAMILIES (CONTINUED)",null,null,null,null,null,null,null,null,null,null,null,null,null,null,null,"E.  PROGRAMS AND SERVICES FOR ELs AND THEIR FAMILIES (CONTINUED)",null,null,null,null,null,null,null,null,null,null,null,null,null,null,null,"E.  PROGRAMS AND SERVICES FOR ELs AND THEIR FAMILIES (CONTINUED)",null,null,null,null,null,null,null,null,null,null,null,null,null,null,null,"E.  PROGRAMS AND SERVICES FOR ELs AND THEIR FAMILIES (CONTINUED)",null,null,null,null,null,null,null,null,null,null,null,null,null,null,null,"E.  PROGRAMS AND SERVICES FOR ELs AND THEIR FAMILIES (CONTINUED)",null,null,null,null,null,null,null,null,null,null,null,null,null,null,null,"E.  PROGRAMS AND SERVICES FOR ELs AND THEIR FAMILIES (CONTINUED)",null,null,null,null,null,null,null,null,null,null,null,null,null,null,null,"E.  PROGRAMS AND SERVICES FOR ELs AND THEIR FAMILIES (CONTINUED)",null,null,null,null,null,null,null,null,null,null,null,null,null,null,null,"E.  PROGRAMS AND SERVICES FOR ELs AND THEIR FAMILIES (CONTINUED)",null,null,null,null,null,null,null,null,null,null,null,null,null,null,null,"E.  PROGRAMS AND SERVICES FOR ELs AND THEIR FAMILIES (CONTINUED)",null,null,null,null,null,null,null,null,null,null,null,null,null,null,null,"E.  PROGRAMS AND SERVICES FOR ELs AND THEIR FAMILIES (CONTINUED)",null,null,null,null,null,null,null,null,null,null,null,null,null,null,null,"E.  PROGRAMS AND SERVICES FOR ELs AND THEIR FAMILIES (CONTINUED)",null,null,null,null,null,null,null,null,null,null,null,null,null,null,null,"E.  PROGRAMS AND SERVICES FOR ELs AND THEIR FAMILIES (CONTINUED)",null,null,null,null,null,null,null,null,null,null,null,null,null,null,null,"E.  PROGRAMS AND SERVICES FOR ELs AND THEIR FAMILIES (CONTINUED)",null,null,null,null,null,null,null,null,null,null,null,null,null,null,null,"E.  PROGRAMS AND SERVICES FOR ELs AND THEIR FAMILIES (CONTINUED)",null,null,null,null,null,null,null,null,null,null,null,null,null,null,null,"E.  PROGRAMS AND SERVICES FOR ELs AND THEIR FAMILIES (CONTINUED)",null,null,null,null,null,null,null,null,null,null,null,null,null,null,null,"E.  PROGRAMS AND SERVICES FOR ELs AND THEIR FAMILIES (CONTINUED)",null,null,null,null,null,null,null,null,null,null,null,null,null,null,null,"E.  PROGRAMS AND SERVICES FOR ELs AND THEIR FAMILIES (CONTINUED)",null,null,null,null,null,null,null,null,null,null,null,null,null,null,null,"E.  PROGRAMS AND SERVICES FOR ELs AND THEIR FAMILIES (CONTINUED)",null,null,null,null,null,null,null,null,null,null,null,null,null,null,null,"E.  PROGRAMS AND SERVICES FOR ELs AND THEIR FAMILIES (CONTINUED)",null,null,null,null,null,null,null,null,null,null,null,null,null,null,null,"E.  PROGRAMS AND SERVICES FOR ELs AND THEIR FAMILIES (CONTINUED)",null,null,null,null,null,null,null,null,null,null,null,null,null,null,null,"E.  PROGRAMS AND SERVICES FOR ELs AND THEIR FAMILIES (CONTINUED)",null,null,null,null,null,null,null,null,null,null,null,null,null,null,null,"E.  PROGRAMS AND SERVICES FOR ELs AND THEIR FAMILIES (CONTINUED)",null,null,null,null,null,null,null,null,null,null,null,null,null,null,null,"E.  PROGRAMS AND SERVICES FOR ELs AND THEIR FAMILIES (CONTINUED)",null,null,null,null,null,null,null,null,null,null,null,null,null,null,null,"E.  PROGRAMS AND SERVICES FOR ELs AND THEIR FAMILIES (CONTINUED)",null,null,null,null,null,null,null,null,null,null,null,null,null,null,null,"E.  PROGRAMS AND SERVICES FOR ELs AND THEIR FAMILIES (CONTINUED)",null,null,null,null,null,null,null,null,null,null,null,null,null,null,null,"E.  PROGRAMS AND SERVICES FOR ELs AND THEIR FAMILIES (CONTINUED)",null,null,null,null,null,null,null,null,null,null,null,null,null,null,null,"E.  PROGRAMS AND SERVICES FOR ELs AND THEIR FAMILIES (CONTINUED)",null,null,null,null,null,null,null,null,null,null,null,null,null,null,null,"E.  PROGRAMS AND SERVICES FOR ELs AND THEIR FAMILIES (CONTINUED)",null,null,null,null,null,null,null,null,null,null,null,null,null,null,null,"E.  PROGRAMS AND SERVICES FOR ELs AND THEIR FAMILIES (CONTINUED)",null,null,null,null,null,null,null,null,null,null,null,null,null,null,null,"E.  PROGRAMS AND SERVICES FOR ELs AND THEIR FAMILIES (CONTINUED)",null,null,null,null,null,null,null,null,null,null,null,null,null,null,null,"E.  PROGRAMS AND SERVICES FOR ELs AND THEIR FAMILIES (CONTINUED)",null,null,null,null,null,null,null,null,null,null,null,null,null,null,null,"E.  PROGRAMS AND SERVICES FOR ELs AND THEIR FAMILIES (CONTINUED)",null,null,null,null,null,null,null,null,null,null,null,null,null,null,null,"E.  PROGRAMS AND SERVICES FOR ELs AND THEIR FAMILIES (CONTINUED)",null,null,null,null,null,null,null,null,null,null,null,null,null,null,null,"E.  PROGRAMS AND SERVICES FOR ELs AND THEIR FAMILIES (CONTINUED)",null,null,null,null,null,null,null,null,null,null,null,null,null,null,null,"E.  PROGRAMS AND SERVICES FOR ELs AND THEIR FAMILIES (CONTINUED)",null,null,null,null,null,null,null,null,null,null,null,null,null,null,null,"E.  PROGRAMS AND SERVICES FOR ELs AND THEIR FAMILIES (CONTINUED)",null,null,null,null,null,null,null,null,null,null,null,null,null,null,null,"E.  PROGRAMS AND SERVICES FOR ELs AND THEIR FAMILIES (CONTINUED)",null,null,null,null,null,null,null,null,null,null,null,null,null,null,null,"E.  PROGRAMS AND SERVICES FOR ELs AND THEIR FAMILIES (CONTINUED)",null,null,null,null,null,null,null,null,null,null,null,null,null,null,null,"E.  PROGRAMS AND SERVICES FOR ELs AND THEIR FAMILIES (CONTINUED)",null,null,null,null,null,null,null,null,null,null,null,null,null,null,null,"E.  PROGRAMS AND SERVICES FOR ELs AND THEIR FAMILIES (CONTINUED)",null,null,null,null,null,null,null,null,null,null,null,null,null,null,null,"E.  PROGRAMS AND SERVICES FOR ELs AND THEIR FAMILIES (CONTINUED)",null,null,null,null,null,null,null,null,null,null,null,null,null,null,null,"E.  PROGRAMS AND SERVICES FOR ELs AND THEIR FAMILIES (CONTINUED)",null,null,null,null,null,null,null,null,null,null,null,null,null,null,null,"E.  PROGRAMS AND SERVICES FOR ELs AND THEIR FAMILIES (CONTINUED)",null,null,null,null,null,null,null,null,null,null,null,null,null,null,null,"E.  PROGRAMS AND SERVICES FOR ELs AND THEIR FAMILIES (CONTINUED)",null,null,null,null,null,null,null,null,null,null,null,null,null,null,null,"E.  PROGRAMS AND SERVICES FOR ELs AND THEIR FAMILIES (CONTINUED)",null,null,null,null,null,null,null,null,null,null,null,null,null,null,null,"E.  PROGRAMS AND SERVICES FOR ELs AND THEIR FAMILIES (CONTINUED)",null,null,null,null,null,null,null,null,null,null,null,null,null,null,null,"E.  PROGRAMS AND SERVICES FOR ELs AND THEIR FAMILIES (CONTINUED)",null,null,null,null,null,null,null,null,null,null,null,null,null,null,null,"E.  PROGRAMS AND SERVICES FOR ELs AND THEIR FAMILIES (CONTINUED)",null,null,null,null,null,null,null,null,null,null,null,null,null,null,null,"E.  PROGRAMS AND SERVICES FOR ELs AND THEIR FAMILIES (CONTINUED)",null,null,null,null,null,null,null,null,null,null,null,null,null,null,null,"E.  PROGRAMS AND SERVICES FOR ELs AND THEIR FAMILIES (CONTINUED)",null,null,null,null,null,null,null,null,null,null,null,null,null,null,null,"E.  PROGRAMS AND SERVICES FOR ELs AND THEIR FAMILIES (CONTINUED)",null,null,null,null,null,null,null,null,null,null,null,null,null,null,null,"E.  PROGRAMS AND SERVICES FOR ELs AND THEIR FAMILIES (CONTINUED)",null,null,null,null,null,null,null,null,null,null,null,null,null,null,null,"E.  PROGRAMS AND SERVICES FOR ELs AND THEIR FAMILIES (CONTINUED)",null,null,null,null,null,null,null,null,null,null,null,null,null,null,null,"E.  PROGRAMS AND SERVICES FOR ELs AND THEIR FAMILIES (CONTINUED)",null,null,null,null,null,null,null,null,null,null,null,null,null,null,null,"E.  PROGRAMS AND SERVICES FOR ELs AND THEIR FAMILIES (CONTINUED)",null,null,null,null,null,null,null,null,null,null,null,null,null,null,null,"E.  PROGRAMS AND SERVICES FOR ELs AND THEIR FAMILIES (CONTINUED)",null,null,null,null,null,null,null,null,null,null,null,null,null,null,null,"E.  PROGRAMS AND SERVICES FOR ELs AND THEIR FAMILIES (CONTINUED)",null,null,null,null,null,null,null,null,null,null,null,null,null,null,null,"E.  PROGRAMS AND SERVICES FOR ELs AND THEIR FAMILIES (CONTINUED)",null,null,null,null,null,null,null,null,null,null,null,null,null,null,null,"E.  PROGRAMS AND SERVICES FOR ELs AND THEIR FAMILIES (CONTINUED)",null,null,null,null,null,null,null,null,null,null,null,null,null,null,null,"E.  PROGRAMS AND SERVICES FOR ELs AND THEIR FAMILIES (CONTINUED)",null,null,null,null,null,null,null,null,null,null,null,null,null,null,null,"E.  PROGRAMS AND SERVICES FOR ELs AND THEIR FAMILIES (CONTINUED)",null,null,null,null,null,null,null,null,null,null,null,null,null,null,null,"E.  PROGRAMS AND SERVICES FOR ELs AND THEIR FAMILIES (CONTINUED)",null,null,null,null,null,null,null,null,null,null,null,null,null,null,null,"E.  PROGRAMS AND SERVICES FOR ELs AND THEIR FAMILIES (CONTINUED)",null,null,null,null,null,null,null,null,null,null,null,null,null,null,null,"E.  PROGRAMS AND SERVICES FOR ELs AND THEIR FAMILIES (CONTINUED)",null,null,null,null,null,null,null,null,null,null,null,null,null,null,null,"E.  PROGRAMS AND SERVICES FOR ELs AND THEIR FAMILIES (CONTINUED)",null,null,null,null,null,null,null,null,null,null,null,null,null,null,null,"E.  PROGRAMS AND SERVICES FOR ELs AND THEIR FAMILIES (CONTINUED)",null,null,null,null,null,null,null,null,null,null,null,null,null,null,null,"E.  PROGRAMS AND SERVICES FOR ELs AND THEIR FAMILIES (CONTINUED)",null,null,null,null,null,null,null,null,null,null,null,null,null,null,null,"E.  PROGRAMS AND SERVICES FOR ELs AND THEIR FAMILIES (CONTINUED)",null,null,null,null,null,null,null,null,null,null,null,null,null,null,null,"E.  PROGRAMS AND SERVICES FOR ELs AND THEIR FAMILIES (CONTINUED)",null,null,null,null,null,null,null,null,null,null,null,null,null,null,null,"E.  PROGRAMS AND SERVICES FOR ELs AND THEIR FAMILIES (CONTINUED)",null,null,null,null,null,null,null,null,null,null,null,null,null,null,null,"E.  PROGRAMS AND SERVICES FOR ELs AND THEIR FAMILIES (CONTINUED)",null,null,null,null,null,null,null,null,null,null,null,null,null,null,null,"E.  PROGRAMS AND SERVICES FOR ELs AND THEIR FAMILIES (CONTINUED)",null,null,null,null,null,null,null,null,null,null,null,null,null,null,null,"E.  PROGRAMS AND SERVICES FOR ELs AND THEIR FAMILIES (CONTINUED)",null,null,null,null,null,null,null,null,null,null,null,null,null,null,null,"E.  PROGRAMS AND SERVICES FOR ELs AND THEIR FAMILIES (CONTINUED)",null,null,null,null,null,null,null,null,null,null,null,null,null,null,null,"E.  PROGRAMS AND SERVICES FOR ELs AND THEIR FAMILIES (CONTINUED)",null,null,null,null,null,null,null,null,null,null,null,null,null,null,null,"E.  PROGRAMS AND SERVICES FOR ELs AND THEIR FAMILIES (CONTINUED)",null,null,null,null,null,null,null,null,null,null,null,null,null,null,null,"E.  PROGRAMS AND SERVICES FOR ELs AND THEIR FAMILIES (CONTINUED)",null,null,null,null,null,null,null,null,null,null,null,null,null,null,null,"E.  PROGRAMS AND SERVICES FOR ELs AND THEIR FAMILIES (CONTINUED)",null,null,null,null,null,null,null,null,null,null,null,null,null,null,null,"E.  PROGRAMS AND SERVICES FOR ELs AND THEIR FAMILIES (CONTINUED)",null,null,null,null,null,null,null,null,null,null,null,null,null,null,null,"E.  PROGRAMS AND SERVICES FOR ELs AND THEIR FAMILIES (CONTINUED)",null,null,null,null,null,null,null,null,null,null,null,null,null,null,null,"E.  PROGRAMS AND SERVICES FOR ELs AND THEIR FAMILIES (CONTINUED)",null,null,null,null,null,null,null,null,null,null,null,null,null,null,null,"E.  PROGRAMS AND SERVICES FOR ELs AND THEIR FAMILIES (CONTINUED)",null,null,null,null,null,null,null,null,null,null,null,null,null,null,null,"E.  PROGRAMS AND SERVICES FOR ELs AND THEIR FAMILIES (CONTINUED)",null,null,null,null,null,null,null,null,null,null,null,null,null,null,null,"E.  PROGRAMS AND SERVICES FOR ELs AND THEIR FAMILIES (CONTINUED)",null,null,null,null,null,null,null,null,null,null,null,null,null,null,null,"E.  PROGRAMS AND SERVICES FOR ELs AND THEIR FAMILIES (CONTINUED)",null,null,null,null,null,null,null,null,null,null,null,null,null,null,null,"E.  PROGRAMS AND SERVICES FOR ELs AND THEIR FAMILIES (CONTINUED)",null,null,null,null,null,null,null,null,null,null,null,null,null,null,null,"E.  PROGRAMS AND SERVICES FOR ELs AND THEIR FAMILIES (CONTINUED)",null,null,null,null,null,null,null,null,null,null,null,null,null,null,null,"E.  PROGRAMS AND SERVICES FOR ELs AND THEIR FAMILIES (CONTINUED)",null,null,null,null,null,null,null,null,null,null,null,null,null,null,null,"E.  PROGRAMS AND SERVICES FOR ELs AND THEIR FAMILIES (CONTINUED)",null,null,null,null,null,null,null,null,null,null,null,null,null,null,null,"E.  PROGRAMS AND SERVICES FOR ELs AND THEIR FAMILIES (CONTINUED)",null,null,null,null,null,null,null,null,null,null,null,null,null,null,null,"E.  PROGRAMS AND SERVICES FOR ELs AND THEIR FAMILIES (CONTINUED)"]
[]
["Implementation of an Effective LIEP Supported by Local and/or State Funds: The division must carry out a comprehensive analysis of the EL population within the division in order to 1) design programs and services that will meet the needs of students; and 2) to determine the necessary resources for an effective implementation of the LIEP.  "]
[]
["Box 3:  Provide the following information regarding the division-wide EL population for SY 2018-2019."]
[null,"The number of ELs division-wide (Level 1-4.3)",null,null,null,null,null,null,null,null,null,null,946]
[null,"The percentage of ELs who reached proficiency (4.4+ on the ACCESS for ELLs assessment)\n\n",null,null,null,null,null,null,null,null,null,null,0.13]
[null,"The percentage of ELs who made progress toward reaching proficiency\n\n",null,null,null,null,null,null,null,null,null,null,0.57330000000000003]
[null,"The number of endorsed ESL teachers directly serving ELs",null,null,null,null,null,null,null,null,null,null,40]
[]
["Box 4:  Identify the amount of targeted language instruction for ELs the division determines appropriate at each proficiency level and/or grade span level."]
["ACPS has specific instructional guidelines and staffing formulas that provide a baseline for designing programming for ELs. For staffing allocations, we consider the number of ELs at a school, based on their grade and English Language Proficiency (ELP) levels. ESOL teachers work with students to set quarterly goals in the four language domains of listening, speaking, reading, and writing. The goals are individualized based on ELs’ ELP levels, and drawn from the WIDA Can Do Descriptors and our teacher-created ESOL Language Goals.\nOur approximate instructional minutes at the elementary school level are as follows: Levels 1.0-1.9 = 100-150 minutes/week; Levels 2.0-2.9 = 60-120 minutes/week; Levels 3.0-3.9 = 30-90 minutes/week; Level 4.0-4.3 = 30-45 minutes/week; and Level 6 Formerly ELs = quarterly conferencing.\nOur approximate instructional minutes at the middle school level are as follows: Levels 1.0-1.9 = 900 minutes/week; Levels 2.0-2.9 = 450 minutes/week; Levels 3.0-3.9 = 450 minutes/week; Level 4.0-4.3 = 225 minutes/week; and Level 6 Formerly ELs = quarterly conferencing.\nOur approximate instructional minutes at the high school level are as follows: Levels 1.0-1.9 = 300 minutes/week; Levels 2.0-2.9 = 200 minutes/week; Levels 3.0-3.9 = 120 minutes/week; Level 4.0-4.3 = 45 minutes/week; and Level 6 Formerly ELs = quarterly conferencing.\n\nThe amount of instructional time received is determined and adjusted by (1) the EL’s linguistic progress on ACPS’ quarterly benchmarks for ELs; (2) grade level; (3) teacher scheduling; and (4) clustering of ELs. Our purpose in doubling the service minutes at the secondary level is to create a sense of urgency with school-based stakeholders in an effort to accelerate older ELs’ English acquisition and graduate on time. Schools strive to provide ELs with the best balance of time with their ESOL teachers, classroom/content teacher(s), and grade-level peers."]
[]
["Evaluation of the Effectiveness of the LIEP Supported by Local and/or State Funds: The division must evaluate the LIEP to determine its effectiveness in helping ELs make progress toward achieving English proficiency, exit the LIEP, and meet challenging State academic standards within a reasonable timeframe."]
[]
["Box 5:  Describe the division’s procedures to evaluate programs and services for ELs.  Include the following information:\n• A timeline for evaluation; \n• The titles of stakeholders involved in the evaluation process; and \n• The data collected by the division to determine the effectiveness of the LIEP.  Data elements may include EL academic achievement indicators by grade span or content area, specific LIEP secondary courses, student or parent surveys, EL graduation rates, ELs with disabilities, Long Term ELs, formerly ELs (4.4+ on the ACCESS for ELLs assessment)."]
["We collect data via intentional and ongoing: classroom walkthroughs with school administrators; conversations with teachers of ELs during ESOL classes; periodic review of ESOL teacher lesson plans; interactions with families and educational partners at family and community engagement events or in our office; teacher discussions during PLCs and PD workshops; development and review of Standard Operating Procedures (SOPs); and audits of teacher caseloads. \n\nAdditionally, we analyze quantitative data at key times during the year through (1) Quarterly ESOL Progress Reports; (2) ESOL Office cross-checks for supplemental support needed by ELs listed on our PowerSchool “Low Grade Report;” (3) SOL content area exam results, and gaps between overall school averages and ELs’ pass rates; (4) WIDA ACCESS for ELLs 2.0 English language proficiency exam results, and cross-checks for new Long-Term ELs; and (5) conferences between ESOL teachers, content area teachers, and ELs to discuss linguistic progress as demonstrated on their ACCESS Score Reports; (6) quarterly comparison between ELs’ ELP levels and our ACPS ESOL Benchmarks to determine expected linguistic growth and needed supports; and (7) surveys after each ESOL Team PD to collect feedback on instruction, expectations, and equity gaps, and gage our program’s effectiveness and direction.\n"]
["Page 22"]
[null,null,null,null,"School Division:",null,{"$f":"'Title III Budget'!$A$16","v":"ALBEMARLE COUNTY PUBLIC SCHOOLS"},null,null,null,null,null,"Division Number:",null,null,{"$f":"'Title III Budget'!$H$16","v":2}]
[]
["E.  PROGRAMS AND SERVICES FOR ELs AND THEIR FAMILIES (CONTINUED)",null,null,null,null,null,null,null,null,null,null,null,null,null,null,null,null,null,null,null,null,null,null,null,null,null,null,null,null,null,null,null,"E.  PROGRAMS AND SERVICES FOR ELs AND THEIR FAMILIES (CONTINUED)",null,null,null,null,null,null,null,null,null,null,null,null,null,null,null,"E.  PROGRAMS AND SERVICES FOR ELs AND THEIR FAMILIES (CONTINUED)",null,null,null,null,null,null,null,null,null,null,null,null,null,null,null,"E.  PROGRAMS AND SERVICES FOR ELs AND THEIR FAMILIES (CONTINUED)",null,null,null,null,null,null,null,null,null,null,null,null,null,null,null,"E.  PROGRAMS AND SERVICES FOR ELs AND THEIR FAMILIES (CONTINUED)",null,null,null,null,null,null,null,null,null,null,null,null,null,null,null,"E.  PROGRAMS AND SERVICES FOR ELs AND THEIR FAMILIES (CONTINUED)",null,null,null,null,null,null,null,null,null,null,null,null,null,null,null,"E.  PROGRAMS AND SERVICES FOR ELs AND THEIR FAMILIES (CONTINUED)",null,null,null,null,null,null,null,null,null,null,null,null,null,null,null,"E.  PROGRAMS AND SERVICES FOR ELs AND THEIR FAMILIES (CONTINUED)",null,null,null,null,null,null,null,null,null,null,null,null,null,null,null,"E.  PROGRAMS AND SERVICES FOR ELs AND THEIR FAMILIES (CONTINUED)",null,null,null,null,null,null,null,null,null,null,null,null,null,null,null,"E.  PROGRAMS AND SERVICES FOR ELs AND THEIR FAMILIES (CONTINUED)",null,null,null,null,null,null,null,null,null,null,null,null,null,null,null,"E.  PROGRAMS AND SERVICES FOR ELs AND THEIR FAMILIES (CONTINUED)",null,null,null,null,null,null,null,null,null,null,null,null,null,null,null,"E.  PROGRAMS AND SERVICES FOR ELs AND THEIR FAMILIES (CONTINUED)",null,null,null,null,null,null,null,null,null,null,null,null,null,null,null,"E.  PROGRAMS AND SERVICES FOR ELs AND THEIR FAMILIES (CONTINUED)",null,null,null,null,null,null,null,null,null,null,null,null,null,null,null,"E.  PROGRAMS AND SERVICES FOR ELs AND THEIR FAMILIES (CONTINUED)",null,null,null,null,null,null,null,null,null,null,null,null,null,null,null,"E.  PROGRAMS AND SERVICES FOR ELs AND THEIR FAMILIES (CONTINUED)",null,null,null,null,null,null,null,null,null,null,null,null,null,null,null,"E.  PROGRAMS AND SERVICES FOR ELs AND THEIR FAMILIES (CONTINUED)",null,null,null,null,null,null,null,null,null,null,null,null,null,null,null,"E.  PROGRAMS AND SERVICES FOR ELs AND THEIR FAMILIES (CONTINUED)",null,null,null,null,null,null,null,null,null,null,null,null,null,null,null,"E.  PROGRAMS AND SERVICES FOR ELs AND THEIR FAMILIES (CONTINUED)",null,null,null,null,null,null,null,null,null,null,null,null,null,null,null,"E.  PROGRAMS AND SERVICES FOR ELs AND THEIR FAMILIES (CONTINUED)",null,null,null,null,null,null,null,null,null,null,null,null,null,null,null,"E.  PROGRAMS AND SERVICES FOR ELs AND THEIR FAMILIES (CONTINUED)",null,null,null,null,null,null,null,null,null,null,null,null,null,null,null,"E.  PROGRAMS AND SERVICES FOR ELs AND THEIR FAMILIES (CONTINUED)",null,null,null,null,null,null,null,null,null,null,null,null,null,null,null,"E.  PROGRAMS AND SERVICES FOR ELs AND THEIR FAMILIES (CONTINUED)",null,null,null,null,null,null,null,null,null,null,null,null,null,null,null,"E.  PROGRAMS AND SERVICES FOR ELs AND THEIR FAMILIES (CONTINUED)",null,null,null,null,null,null,null,null,null,null,null,null,null,null,null,"E.  PROGRAMS AND SERVICES FOR ELs AND THEIR FAMILIES (CONTINUED)",null,null,null,null,null,null,null,null,null,null,null,null,null,null,null,"E.  PROGRAMS AND SERVICES FOR ELs AND THEIR FAMILIES (CONTINUED)",null,null,null,null,null,null,null,null,null,null,null,null,null,null,null,"E.  PROGRAMS AND SERVICES FOR ELs AND THEIR FAMILIES (CONTINUED)",null,null,null,null,null,null,null,null,null,null,null,null,null,null,null,"E.  PROGRAMS AND SERVICES FOR ELs AND THEIR FAMILIES (CONTINUED)",null,null,null,null,null,null,null,null,null,null,null,null,null,null,null,"E.  PROGRAMS AND SERVICES FOR ELs AND THEIR FAMILIES (CONTINUED)",null,null,null,null,null,null,null,null,null,null,null,null,null,null,null,"E.  PROGRAMS AND SERVICES FOR ELs AND THEIR FAMILIES (CONTINUED)",null,null,null,null,null,null,null,null,null,null,null,null,null,null,null,"E.  PROGRAMS AND SERVICES FOR ELs AND THEIR FAMILIES (CONTINUED)",null,null,null,null,null,null,null,null,null,null,null,null,null,null,null,"E.  PROGRAMS AND SERVICES FOR ELs AND THEIR FAMILIES (CONTINUED)",null,null,null,null,null,null,null,null,null,null,null,null,null,null,null,"E.  PROGRAMS AND SERVICES FOR ELs AND THEIR FAMILIES (CONTINUED)",null,null,null,null,null,null,null,null,null,null,null,null,null,null,null,"E.  PROGRAMS AND SERVICES FOR ELs AND THEIR FAMILIES (CONTINUED)",null,null,null,null,null,null,null,null,null,null,null,null,null,null,null,"E.  PROGRAMS AND SERVICES FOR ELs AND THEIR FAMILIES (CONTINUED)",null,null,null,null,null,null,null,null,null,null,null,null,null,null,null,"E.  PROGRAMS AND SERVICES FOR ELs AND THEIR FAMILIES (CONTINUED)",null,null,null,null,null,null,null,null,null,null,null,null,null,null,null,"E.  PROGRAMS AND SERVICES FOR ELs AND THEIR FAMILIES (CONTINUED)",null,null,null,null,null,null,null,null,null,null,null,null,null,null,null,"E.  PROGRAMS AND SERVICES FOR ELs AND THEIR FAMILIES (CONTINUED)",null,null,null,null,null,null,null,null,null,null,null,null,null,null,null,"E.  PROGRAMS AND SERVICES FOR ELs AND THEIR FAMILIES (CONTINUED)",null,null,null,null,null,null,null,null,null,null,null,null,null,null,null,"E.  PROGRAMS AND SERVICES FOR ELs AND THEIR FAMILIES (CONTINUED)",null,null,null,null,null,null,null,null,null,null,null,null,null,null,null,"E.  PROGRAMS AND SERVICES FOR ELs AND THEIR FAMILIES (CONTINUED)",null,null,null,null,null,null,null,null,null,null,null,null,null,null,null,"E.  PROGRAMS AND SERVICES FOR ELs AND THEIR FAMILIES (CONTINUED)",null,null,null,null,null,null,null,null,null,null,null,null,null,null,null,"E.  PROGRAMS AND SERVICES FOR ELs AND THEIR FAMILIES (CONTINUED)",null,null,null,null,null,null,null,null,null,null,null,null,null,null,null,"E.  PROGRAMS AND SERVICES FOR ELs AND THEIR FAMILIES (CONTINUED)",null,null,null,null,null,null,null,null,null,null,null,null,null,null,null,"E.  PROGRAMS AND SERVICES FOR ELs AND THEIR FAMILIES (CONTINUED)",null,null,null,null,null,null,null,null,null,null,null,null,null,null,null,"E.  PROGRAMS AND SERVICES FOR ELs AND THEIR FAMILIES (CONTINUED)",null,null,null,null,null,null,null,null,null,null,null,null,null,null,null,"E.  PROGRAMS AND SERVICES FOR ELs AND THEIR FAMILIES (CONTINUED)",null,null,null,null,null,null,null,null,null,null,null,null,null,null,null,"E.  PROGRAMS AND SERVICES FOR ELs AND THEIR FAMILIES (CONTINUED)",null,null,null,null,null,null,null,null,null,null,null,null,null,null,null,"E.  PROGRAMS AND SERVICES FOR ELs AND THEIR FAMILIES (CONTINUED)",null,null,null,null,null,null,null,null,null,null,null,null,null,null,null,"E.  PROGRAMS AND SERVICES FOR ELs AND THEIR FAMILIES (CONTINUED)",null,null,null,null,null,null,null,null,null,null,null,null,null,null,null,"E.  PROGRAMS AND SERVICES FOR ELs AND THEIR FAMILIES (CONTINUED)",null,null,null,null,null,null,null,null,null,null,null,null,null,null,null,"E.  PROGRAMS AND SERVICES FOR ELs AND THEIR FAMILIES (CONTINUED)",null,null,null,null,null,null,null,null,null,null,null,null,null,null,null,"E.  PROGRAMS AND SERVICES FOR ELs AND THEIR FAMILIES (CONTINUED)",null,null,null,null,null,null,null,null,null,null,null,null,null,null,null,"E.  PROGRAMS AND SERVICES FOR ELs AND THEIR FAMILIES (CONTINUED)",null,null,null,null,null,null,null,null,null,null,null,null,null,null,null,"E.  PROGRAMS AND SERVICES FOR ELs AND THEIR FAMILIES (CONTINUED)",null,null,null,null,null,null,null,null,null,null,null,null,null,null,null,"E.  PROGRAMS AND SERVICES FOR ELs AND THEIR FAMILIES (CONTINUED)",null,null,null,null,null,null,null,null,null,null,null,null,null,null,null,"E.  PROGRAMS AND SERVICES FOR ELs AND THEIR FAMILIES (CONTINUED)",null,null,null,null,null,null,null,null,null,null,null,null,null,null,null,"E.  PROGRAMS AND SERVICES FOR ELs AND THEIR FAMILIES (CONTINUED)",null,null,null,null,null,null,null,null,null,null,null,null,null,null,null,"E.  PROGRAMS AND SERVICES FOR ELs AND THEIR FAMILIES (CONTINUED)",null,null,null,null,null,null,null,null,null,null,null,null,null,null,null,"E.  PROGRAMS AND SERVICES FOR ELs AND THEIR FAMILIES (CONTINUED)",null,null,null,null,null,null,null,null,null,null,null,null,null,null,null,"E.  PROGRAMS AND SERVICES FOR ELs AND THEIR FAMILIES (CONTINUED)",null,null,null,null,null,null,null,null,null,null,null,null,null,null,null,"E.  PROGRAMS AND SERVICES FOR ELs AND THEIR FAMILIES (CONTINUED)",null,null,null,null,null,null,null,null,null,null,null,null,null,null,null,"E.  PROGRAMS AND SERVICES FOR ELs AND THEIR FAMILIES (CONTINUED)",null,null,null,null,null,null,null,null,null,null,null,null,null,null,null,"E.  PROGRAMS AND SERVICES FOR ELs AND THEIR FAMILIES (CONTINUED)",null,null,null,null,null,null,null,null,null,null,null,null,null,null,null,"E.  PROGRAMS AND SERVICES FOR ELs AND THEIR FAMILIES (CONTINUED)",null,null,null,null,null,null,null,null,null,null,null,null,null,null,null,"E.  PROGRAMS AND SERVICES FOR ELs AND THEIR FAMILIES (CONTINUED)",null,null,null,null,null,null,null,null,null,null,null,null,null,null,null,"E.  PROGRAMS AND SERVICES FOR ELs AND THEIR FAMILIES (CONTINUED)",null,null,null,null,null,null,null,null,null,null,null,null,null,null,null,"E.  PROGRAMS AND SERVICES FOR ELs AND THEIR FAMILIES (CONTINUED)",null,null,null,null,null,null,null,null,null,null,null,null,null,null,null,"E.  PROGRAMS AND SERVICES FOR ELs AND THEIR FAMILIES (CONTINUED)",null,null,null,null,null,null,null,null,null,null,null,null,null,null,null,"E.  PROGRAMS AND SERVICES FOR ELs AND THEIR FAMILIES (CONTINUED)",null,null,null,null,null,null,null,null,null,null,null,null,null,null,null,"E.  PROGRAMS AND SERVICES FOR ELs AND THEIR FAMILIES (CONTINUED)",null,null,null,null,null,null,null,null,null,null,null,null,null,null,null,"E.  PROGRAMS AND SERVICES FOR ELs AND THEIR FAMILIES (CONTINUED)",null,null,null,null,null,null,null,null,null,null,null,null,null,null,null,"E.  PROGRAMS AND SERVICES FOR ELs AND THEIR FAMILIES (CONTINUED)",null,null,null,null,null,null,null,null,null,null,null,null,null,null,null,"E.  PROGRAMS AND SERVICES FOR ELs AND THEIR FAMILIES (CONTINUED)",null,null,null,null,null,null,null,null,null,null,null,null,null,null,null,"E.  PROGRAMS AND SERVICES FOR ELs AND THEIR FAMILIES (CONTINUED)",null,null,null,null,null,null,null,null,null,null,null,null,null,null,null,"E.  PROGRAMS AND SERVICES FOR ELs AND THEIR FAMILIES (CONTINUED)",null,null,null,null,null,null,null,null,null,null,null,null,null,null,null,"E.  PROGRAMS AND SERVICES FOR ELs AND THEIR FAMILIES (CONTINUED)",null,null,null,null,null,null,null,null,null,null,null,null,null,null,null,"E.  PROGRAMS AND SERVICES FOR ELs AND THEIR FAMILIES (CONTINUED)",null,null,null,null,null,null,null,null,null,null,null,null,null,null,null,"E.  PROGRAMS AND SERVICES FOR ELs AND THEIR FAMILIES (CONTINUED)",null,null,null,null,null,null,null,null,null,null,null,null,null,null,null,"E.  PROGRAMS AND SERVICES FOR ELs AND THEIR FAMILIES (CONTINUED)",null,null,null,null,null,null,null,null,null,null,null,null,null,null,null,"E.  PROGRAMS AND SERVICES FOR ELs AND THEIR FAMILIES (CONTINUED)",null,null,null,null,null,null,null,null,null,null,null,null,null,null,null,"E.  PROGRAMS AND SERVICES FOR ELs AND THEIR FAMILIES (CONTINUED)",null,null,null,null,null,null,null,null,null,null,null,null,null,null,null,"E.  PROGRAMS AND SERVICES FOR ELs AND THEIR FAMILIES (CONTINUED)",null,null,null,null,null,null,null,null,null,null,null,null,null,null,null,"E.  PROGRAMS AND SERVICES FOR ELs AND THEIR FAMILIES (CONTINUED)",null,null,null,null,null,null,null,null,null,null,null,null,null,null,null,"E.  PROGRAMS AND SERVICES FOR ELs AND THEIR FAMILIES (CONTINUED)",null,null,null,null,null,null,null,null,null,null,null,null,null,null,null,"E.  PROGRAMS AND SERVICES FOR ELs AND THEIR FAMILIES (CONTINUED)",null,null,null,null,null,null,null,null,null,null,null,null,null,null,null,"E.  PROGRAMS AND SERVICES FOR ELs AND THEIR FAMILIES (CONTINUED)",null,null,null,null,null,null,null,null,null,null,null,null,null,null,null,"E.  PROGRAMS AND SERVICES FOR ELs AND THEIR FAMILIES (CONTINUED)",null,null,null,null,null,null,null,null,null,null,null,null,null,null,null,"E.  PROGRAMS AND SERVICES FOR ELs AND THEIR FAMILIES (CONTINUED)",null,null,null,null,null,null,null,null,null,null,null,null,null,null,null,"E.  PROGRAMS AND SERVICES FOR ELs AND THEIR FAMILIES (CONTINUED)",null,null,null,null,null,null,null,null,null,null,null,null,null,null,null,"E.  PROGRAMS AND SERVICES FOR ELs AND THEIR FAMILIES (CONTINUED)",null,null,null,null,null,null,null,null,null,null,null,null,null,null,null,"E.  PROGRAMS AND SERVICES FOR ELs AND THEIR FAMILIES (CONTINUED)",null,null,null,null,null,null,null,null,null,null,null,null,null,null,null,"E.  PROGRAMS AND SERVICES FOR ELs AND THEIR FAMILIES (CONTINUED)",null,null,null,null,null,null,null,null,null,null,null,null,null,null,null,"E.  PROGRAMS AND SERVICES FOR ELs AND THEIR FAMILIES (CONTINUED)",null,null,null,null,null,null,null,null,null,null,null,null,null,null,null,"E.  PROGRAMS AND SERVICES FOR ELs AND THEIR FAMILIES (CONTINUED)",null,null,null,null,null,null,null,null,null,null,null,null,null,null,null,"E.  PROGRAMS AND SERVICES FOR ELs AND THEIR FAMILIES (CONTINUED)",null,null,null,null,null,null,null,null,null,null,null,null,null,null,null,"E.  PROGRAMS AND SERVICES FOR ELs AND THEIR FAMILIES (CONTINUED)",null,null,null,null,null,null,null,null,null,null,null,null,null,null,null,"E.  PROGRAMS AND SERVICES FOR ELs AND THEIR FAMILIES (CONTINUED)",null,null,null,null,null,null,null,null,null,null,null,null,null,null,null,"E.  PROGRAMS AND SERVICES FOR ELs AND THEIR FAMILIES (CONTINUED)",null,null,null,null,null,null,null,null,null,null,null,null,null,null,null,"E.  PROGRAMS AND SERVICES FOR ELs AND THEIR FAMILIES (CONTINUED)",null,null,null,null,null,null,null,null,null,null,null,null,null,null,null,"E.  PROGRAMS AND SERVICES FOR ELs AND THEIR FAMILIES (CONTINUED)",null,null,null,null,null,null,null,null,null,null,null,null,null,null,null,"E.  PROGRAMS AND SERVICES FOR ELs AND THEIR FAMILIES (CONTINUED)",null,null,null,null,null,null,null,null,null,null,null,null,null,null,null,"E.  PROGRAMS AND SERVICES FOR ELs AND THEIR FAMILIES (CONTINUED)",null,null,null,null,null,null,null,null,null,null,null,null,null,null,null,"E.  PROGRAMS AND SERVICES FOR ELs AND THEIR FAMILIES (CONTINUED)",null,null,null,null,null,null,null,null,null,null,null,null,null,null,null,"E.  PROGRAMS AND SERVICES FOR ELs AND THEIR FAMILIES (CONTINUED)",null,null,null,null,null,null,null,null,null,null,null,null,null,null,null,"E.  PROGRAMS AND SERVICES FOR ELs AND THEIR FAMILIES (CONTINUED)",null,null,null,null,null,null,null,null,null,null,null,null,null,null,null,"E.  PROGRAMS AND SERVICES FOR ELs AND THEIR FAMILIES (CONTINUED)",null,null,null,null,null,null,null,null,null,null,null,null,null,null,null,"E.  PROGRAMS AND SERVICES FOR ELs AND THEIR FAMILIES (CONTINUED)",null,null,null,null,null,null,null,null,null,null,null,null,null,null,null,"E.  PROGRAMS AND SERVICES FOR ELs AND THEIR FAMILIES (CONTINUED)",null,null,null,null,null,null,null,null,null,null,null,null,null,null,null,"E.  PROGRAMS AND SERVICES FOR ELs AND THEIR FAMILIES (CONTINUED)",null,null,null,null,null,null,null,null,null,null,null,null,null,null,null,"E.  PROGRAMS AND SERVICES FOR ELs AND THEIR FAMILIES (CONTINUED)",null,null,null,null,null,null,null,null,null,null,null,null,null,null,null,"E.  PROGRAMS AND SERVICES FOR ELs AND THEIR FAMILIES (CONTINUED)",null,null,null,null,null,null,null,null,null,null,null,null,null,null,null,"E.  PROGRAMS AND SERVICES FOR ELs AND THEIR FAMILIES (CONTINUED)",null,null,null,null,null,null,null,null,null,null,null,null,null,null,null,"E.  PROGRAMS AND SERVICES FOR ELs AND THEIR FAMILIES (CONTINUED)",null,null,null,null,null,null,null,null,null,null,null,null,null,null,null,"E.  PROGRAMS AND SERVICES FOR ELs AND THEIR FAMILIES (CONTINUED)",null,null,null,null,null,null,null,null,null,null,null,null,null,null,null,"E.  PROGRAMS AND SERVICES FOR ELs AND THEIR FAMILIES (CONTINUED)",null,null,null,null,null,null,null,null,null,null,null,null,null,null,null,"E.  PROGRAMS AND SERVICES FOR ELs AND THEIR FAMILIES (CONTINUED)",null,null,null,null,null,null,null,null,null,null,null,null,null,null,null,"E.  PROGRAMS AND SERVICES FOR ELs AND THEIR FAMILIES (CONTINUED)",null,null,null,null,null,null,null,null,null,null,null,null,null,null,null,"E.  PROGRAMS AND SERVICES FOR ELs AND THEIR FAMILIES (CONTINUED)",null,null,null,null,null,null,null,null,null,null,null,null,null,null,null,"E.  PROGRAMS AND SERVICES FOR ELs AND THEIR FAMILIES (CONTINUED)",null,null,null,null,null,null,null,null,null,null,null,null,null,null,null,"E.  PROGRAMS AND SERVICES FOR ELs AND THEIR FAMILIES (CONTINUED)",null,null,null,null,null,null,null,null,null,null,null,null,null,null,null,"E.  PROGRAMS AND SERVICES FOR ELs AND THEIR FAMILIES (CONTINUED)",null,null,null,null,null,null,null,null,null,null,null,null,null,null,null,"E.  PROGRAMS AND SERVICES FOR ELs AND THEIR FAMILIES (CONTINUED)",null,null,null,null,null,null,null,null,null,null,null,null,null,null,null,"E.  PROGRAMS AND SERVICES FOR ELs AND THEIR FAMILIES (CONTINUED)",null,null,null,null,null,null,null,null,null,null,null,null,null,null,null,"E.  PROGRAMS AND SERVICES FOR ELs AND THEIR FAMILIES (CONTINUED)",null,null,null,null,null,null,null,null,null,null,null,null,null,null,null,"E.  PROGRAMS AND SERVICES FOR ELs AND THEIR FAMILIES (CONTINUED)",null,null,null,null,null,null,null,null,null,null,null,null,null,null,null,"E.  PROGRAMS AND SERVICES FOR ELs AND THEIR FAMILIES (CONTINUED)",null,null,null,null,null,null,null,null,null,null,null,null,null,null,null,"E.  PROGRAMS AND SERVICES FOR ELs AND THEIR FAMILIES (CONTINUED)",null,null,null,null,null,null,null,null,null,null,null,null,null,null,null,"E.  PROGRAMS AND SERVICES FOR ELs AND THEIR FAMILIES (CONTINUED)",null,null,null,null,null,null,null,null,null,null,null,null,null,null,null,"E.  PROGRAMS AND SERVICES FOR ELs AND THEIR FAMILIES (CONTINUED)",null,null,null,null,null,null,null,null,null,null,null,null,null,null,null,"E.  PROGRAMS AND SERVICES FOR ELs AND THEIR FAMILIES (CONTINUED)",null,null,null,null,null,null,null,null,null,null,null,null,null,null,null,"E.  PROGRAMS AND SERVICES FOR ELs AND THEIR FAMILIES (CONTINUED)",null,null,null,null,null,null,null,null,null,null,null,null,null,null,null,"E.  PROGRAMS AND SERVICES FOR ELs AND THEIR FAMILIES (CONTINUED)",null,null,null,null,null,null,null,null,null,null,null,null,null,null,null,"E.  PROGRAMS AND SERVICES FOR ELs AND THEIR FAMILIES (CONTINUED)",null,null,null,null,null,null,null,null,null,null,null,null,null,null,null,"E.  PROGRAMS AND SERVICES FOR ELs AND THEIR FAMILIES (CONTINUED)",null,null,null,null,null,null,null,null,null,null,null,null,null,null,null,"E.  PROGRAMS AND SERVICES FOR ELs AND THEIR FAMILIES (CONTINUED)",null,null,null,null,null,null,null,null,null,null,null,null,null,null,null,"E.  PROGRAMS AND SERVICES FOR ELs AND THEIR FAMILIES (CONTINUED)",null,null,null,null,null,null,null,null,null,null,null,null,null,null,null,"E.  PROGRAMS AND SERVICES FOR ELs AND THEIR FAMILIES (CONTINUED)",null,null,null,null,null,null,null,null,null,null,null,null,null,null,null,"E.  PROGRAMS AND SERVICES FOR ELs AND THEIR FAMILIES (CONTINUED)",null,null,null,null,null,null,null,null,null,null,null,null,null,null,null,"E.  PROGRAMS AND SERVICES FOR ELs AND THEIR FAMILIES (CONTINUED)",null,null,null,null,null,null,null,null,null,null,null,null,null,null,null,"E.  PROGRAMS AND SERVICES FOR ELs AND THEIR FAMILIES (CONTINUED)",null,null,null,null,null,null,null,null,null,null,null,null,null,null,null,"E.  PROGRAMS AND SERVICES FOR ELs AND THEIR FAMILIES (CONTINUED)",null,null,null,null,null,null,null,null,null,null,null,null,null,null,null,"E.  PROGRAMS AND SERVICES FOR ELs AND THEIR FAMILIES (CONTINUED)",null,null,null,null,null,null,null,null,null,null,null,null,null,null,null,"E.  PROGRAMS AND SERVICES FOR ELs AND THEIR FAMILIES (CONTINUED)",null,null,null,null,null,null,null,null,null,null,null,null,null,null,null,"E.  PROGRAMS AND SERVICES FOR ELs AND THEIR FAMILIES (CONTINUED)",null,null,null,null,null,null,null,null,null,null,null,null,null,null,null,"E.  PROGRAMS AND SERVICES FOR ELs AND THEIR FAMILIES (CONTINUED)",null,null,null,null,null,null,null,null,null,null,null,null,null,null,null,"E.  PROGRAMS AND SERVICES FOR ELs AND THEIR FAMILIES (CONTINUED)",null,null,null,null,null,null,null,null,null,null,null,null,null,null,null,"E.  PROGRAMS AND SERVICES FOR ELs AND THEIR FAMILIES (CONTINUED)",null,null,null,null,null,null,null,null,null,null,null,null,null,null,null,"E.  PROGRAMS AND SERVICES FOR ELs AND THEIR FAMILIES (CONTINUED)",null,null,null,null,null,null,null,null,null,null,null,null,null,null,null,"E.  PROGRAMS AND SERVICES FOR ELs AND THEIR FAMILIES (CONTINUED)",null,null,null,null,null,null,null,null,null,null,null,null,null,null,null,"E.  PROGRAMS AND SERVICES FOR ELs AND THEIR FAMILIES (CONTINUED)",null,null,null,null,null,null,null,null,null,null,null,null,null,null,null,"E.  PROGRAMS AND SERVICES FOR ELs AND THEIR FAMILIES (CONTINUED)",null,null,null,null,null,null,null,null,null,null,null,null,null,null,null,"E.  PROGRAMS AND SERVICES FOR ELs AND THEIR FAMILIES (CONTINUED)",null,null,null,null,null,null,null,null,null,null,null,null,null,null,null,"E.  PROGRAMS AND SERVICES FOR ELs AND THEIR FAMILIES (CONTINUED)",null,null,null,null,null,null,null,null,null,null,null,null,null,null,null,"E.  PROGRAMS AND SERVICES FOR ELs AND THEIR FAMILIES (CONTINUED)",null,null,null,null,null,null,null,null,null,null,null,null,null,null,null,"E.  PROGRAMS AND SERVICES FOR ELs AND THEIR FAMILIES (CONTINUED)",null,null,null,null,null,null,null,null,null,null,null,null,null,null,null,"E.  PROGRAMS AND SERVICES FOR ELs AND THEIR FAMILIES (CONTINUED)",null,null,null,null,null,null,null,null,null,null,null,null,null,null,null,"E.  PROGRAMS AND SERVICES FOR ELs AND THEIR FAMILIES (CONTINUED)",null,null,null,null,null,null,null,null,null,null,null,null,null,null,null,"E.  PROGRAMS AND SERVICES FOR ELs AND THEIR FAMILIES (CONTINUED)",null,null,null,null,null,null,null,null,null,null,null,null,null,null,null,"E.  PROGRAMS AND SERVICES FOR ELs AND THEIR FAMILIES (CONTINUED)",null,null,null,null,null,null,null,null,null,null,null,null,null,null,null,"E.  PROGRAMS AND SERVICES FOR ELs AND THEIR FAMILIES (CONTINUED)",null,null,null,null,null,null,null,null,null,null,null,null,null,null,null,"E.  PROGRAMS AND SERVICES FOR ELs AND THEIR FAMILIES (CONTINUED)",null,null,null,null,null,null,null,null,null,null,null,null,null,null,null,"E.  PROGRAMS AND SERVICES FOR ELs AND THEIR FAMILIES (CONTINUED)",null,null,null,null,null,null,null,null,null,null,null,null,null,null,null,"E.  PROGRAMS AND SERVICES FOR ELs AND THEIR FAMILIES (CONTINUED)",null,null,null,null,null,null,null,null,null,null,null,null,null,null,null,"E.  PROGRAMS AND SERVICES FOR ELs AND THEIR FAMILIES (CONTINUED)",null,null,null,null,null,null,null,null,null,null,null,null,null,null,null,"E.  PROGRAMS AND SERVICES FOR ELs AND THEIR FAMILIES (CONTINUED)",null,null,null,null,null,null,null,null,null,null,null,null,null,null,null,"E.  PROGRAMS AND SERVICES FOR ELs AND THEIR FAMILIES (CONTINUED)",null,null,null,null,null,null,null,null,null,null,null,null,null,null,null,"E.  PROGRAMS AND SERVICES FOR ELs AND THEIR FAMILIES (CONTINUED)",null,null,null,null,null,null,null,null,null,null,null,null,null,null,null,"E.  PROGRAMS AND SERVICES FOR ELs AND THEIR FAMILIES (CONTINUED)",null,null,null,null,null,null,null,null,null,null,null,null,null,null,null,"E.  PROGRAMS AND SERVICES FOR ELs AND THEIR FAMILIES (CONTINUED)",null,null,null,null,null,null,null,null,null,null,null,null,null,null,null,"E.  PROGRAMS AND SERVICES FOR ELs AND THEIR FAMILIES (CONTINUED)",null,null,null,null,null,null,null,null,null,null,null,null,null,null,null,"E.  PROGRAMS AND SERVICES FOR ELs AND THEIR FAMILIES (CONTINUED)",null,null,null,null,null,null,null,null,null,null,null,null,null,null,null,"E.  PROGRAMS AND SERVICES FOR ELs AND THEIR FAMILIES (CONTINUED)",null,null,null,null,null,null,null,null,null,null,null,null,null,null,null,"E.  PROGRAMS AND SERVICES FOR ELs AND THEIR FAMILIES (CONTINUED)",null,null,null,null,null,null,null,null,null,null,null,null,null,null,null,"E.  PROGRAMS AND SERVICES FOR ELs AND THEIR FAMILIES (CONTINUED)",null,null,null,null,null,null,null,null,null,null,null,null,null,null,null,"E.  PROGRAMS AND SERVICES FOR ELs AND THEIR FAMILIES (CONTINUED)",null,null,null,null,null,null,null,null,null,null,null,null,null,null,null,"E.  PROGRAMS AND SERVICES FOR ELs AND THEIR FAMILIES (CONTINUED)",null,null,null,null,null,null,null,null,null,null,null,null,null,null,null,"E.  PROGRAMS AND SERVICES FOR ELs AND THEIR FAMILIES (CONTINUED)",null,null,null,null,null,null,null,null,null,null,null,null,null,null,null,"E.  PROGRAMS AND SERVICES FOR ELs AND THEIR FAMILIES (CONTINUED)",null,null,null,null,null,null,null,null,null,null,null,null,null,null,null,"E.  PROGRAMS AND SERVICES FOR ELs AND THEIR FAMILIES (CONTINUED)",null,null,null,null,null,null,null,null,null,null,null,null,null,null,null,"E.  PROGRAMS AND SERVICES FOR ELs AND THEIR FAMILIES (CONTINUED)",null,null,null,null,null,null,null,null,null,null,null,null,null,null,null,"E.  PROGRAMS AND SERVICES FOR ELs AND THEIR FAMILIES (CONTINUED)",null,null,null,null,null,null,null,null,null,null,null,null,null,null,null,"E.  PROGRAMS AND SERVICES FOR ELs AND THEIR FAMILIES (CONTINUED)",null,null,null,null,null,null,null,null,null,null,null,null,null,null,null,"E.  PROGRAMS AND SERVICES FOR ELs AND THEIR FAMILIES (CONTINUED)",null,null,null,null,null,null,null,null,null,null,null,null,null,null,null,"E.  PROGRAMS AND SERVICES FOR ELs AND THEIR FAMILIES (CONTINUED)",null,null,null,null,null,null,null,null,null,null,null,null,null,null,null,"E.  PROGRAMS AND SERVICES FOR ELs AND THEIR FAMILIES (CONTINUED)",null,null,null,null,null,null,null,null,null,null,null,null,null,null,null,"E.  PROGRAMS AND SERVICES FOR ELs AND THEIR FAMILIES (CONTINUED)",null,null,null,null,null,null,null,null,null,null,null,null,null,null,null,"E.  PROGRAMS AND SERVICES FOR ELs AND THEIR FAMILIES (CONTINUED)",null,null,null,null,null,null,null,null,null,null,null,null,null,null,null,"E.  PROGRAMS AND SERVICES FOR ELs AND THEIR FAMILIES (CONTINUED)",null,null,null,null,null,null,null,null,null,null,null,null,null,null,null,"E.  PROGRAMS AND SERVICES FOR ELs AND THEIR FAMILIES (CONTINUED)",null,null,null,null,null,null,null,null,null,null,null,null,null,null,null,"E.  PROGRAMS AND SERVICES FOR ELs AND THEIR FAMILIES (CONTINUED)",null,null,null,null,null,null,null,null,null,null,null,null,null,null,null,"E.  PROGRAMS AND SERVICES FOR ELs AND THEIR FAMILIES (CONTINUED)",null,null,null,null,null,null,null,null,null,null,null,null,null,null,null,"E.  PROGRAMS AND SERVICES FOR ELs AND THEIR FAMILIES (CONTINUED)",null,null,null,null,null,null,null,null,null,null,null,null,null,null,null,"E.  PROGRAMS AND SERVICES FOR ELs AND THEIR FAMILIES (CONTINUED)",null,null,null,null,null,null,null,null,null,null,null,null,null,null,null,"E.  PROGRAMS AND SERVICES FOR ELs AND THEIR FAMILIES (CONTINUED)",null,null,null,null,null,null,null,null,null,null,null,null,null,null,null,"E.  PROGRAMS AND SERVICES FOR ELs AND THEIR FAMILIES (CONTINUED)",null,null,null,null,null,null,null,null,null,null,null,null,null,null,null,"E.  PROGRAMS AND SERVICES FOR ELs AND THEIR FAMILIES (CONTINUED)",null,null,null,null,null,null,null,null,null,null,null,null,null,null,null,"E.  PROGRAMS AND SERVICES FOR ELs AND THEIR FAMILIES (CONTINUED)",null,null,null,null,null,null,null,null,null,null,null,null,null,null,null,"E.  PROGRAMS AND SERVICES FOR ELs AND THEIR FAMILIES (CONTINUED)",null,null,null,null,null,null,null,null,null,null,null,null,null,null,null,"E.  PROGRAMS AND SERVICES FOR ELs AND THEIR FAMILIES (CONTINUED)",null,null,null,null,null,null,null,null,null,null,null,null,null,null,null,"E.  PROGRAMS AND SERVICES FOR ELs AND THEIR FAMILIES (CONTINUED)",null,null,null,null,null,null,null,null,null,null,null,null,null,null,null,"E.  PROGRAMS AND SERVICES FOR ELs AND THEIR FAMILIES (CONTINUED)",null,null,null,null,null,null,null,null,null,null,null,null,null,null,null,"E.  PROGRAMS AND SERVICES FOR ELs AND THEIR FAMILIES (CONTINUED)",null,null,null,null,null,null,null,null,null,null,null,null,null,null,null,"E.  PROGRAMS AND SERVICES FOR ELs AND THEIR FAMILIES (CONTINUED)",null,null,null,null,null,null,null,null,null,null,null,null,null,null,null,"E.  PROGRAMS AND SERVICES FOR ELs AND THEIR FAMILIES (CONTINUED)",null,null,null,null,null,null,null,null,null,null,null,null,null,null,null,"E.  PROGRAMS AND SERVICES FOR ELs AND THEIR FAMILIES (CONTINUED)",null,null,null,null,null,null,null,null,null,null,null,null,null,null,null,"E.  PROGRAMS AND SERVICES FOR ELs AND THEIR FAMILIES (CONTINUED)",null,null,null,null,null,null,null,null,null,null,null,null,null,null,null,"E.  PROGRAMS AND SERVICES FOR ELs AND THEIR FAMILIES (CONTINUED)",null,null,null,null,null,null,null,null,null,null,null,null,null,null,null,"E.  PROGRAMS AND SERVICES FOR ELs AND THEIR FAMILIES (CONTINUED)",null,null,null,null,null,null,null,null,null,null,null,null,null,null,null,"E.  PROGRAMS AND SERVICES FOR ELs AND THEIR FAMILIES (CONTINUED)",null,null,null,null,null,null,null,null,null,null,null,null,null,null,null,"E.  PROGRAMS AND SERVICES FOR ELs AND THEIR FAMILIES (CONTINUED)",null,null,null,null,null,null,null,null,null,null,null,null,null,null,null,"E.  PROGRAMS AND SERVICES FOR ELs AND THEIR FAMILIES (CONTINUED)",null,null,null,null,null,null,null,null,null,null,null,null,null,null,null,"E.  PROGRAMS AND SERVICES FOR ELs AND THEIR FAMILIES (CONTINUED)",null,null,null,null,null,null,null,null,null,null,null,null,null,null,null,"E.  PROGRAMS AND SERVICES FOR ELs AND THEIR FAMILIES (CONTINUED)",null,null,null,null,null,null,null,null,null,null,null,null,null,null,null,"E.  PROGRAMS AND SERVICES FOR ELs AND THEIR FAMILIES (CONTINUED)",null,null,null,null,null,null,null,null,null,null,null,null,null,null,null,"E.  PROGRAMS AND SERVICES FOR ELs AND THEIR FAMILIES (CONTINUED)",null,null,null,null,null,null,null,null,null,null,null,null,null,null,null,"E.  PROGRAMS AND SERVICES FOR ELs AND THEIR FAMILIES (CONTINUED)",null,null,null,null,null,null,null,null,null,null,null,null,null,null,null,"E.  PROGRAMS AND SERVICES FOR ELs AND THEIR FAMILIES (CONTINUED)",null,null,null,null,null,null,null,null,null,null,null,null,null,null,null,"E.  PROGRAMS AND SERVICES FOR ELs AND THEIR FAMILIES (CONTINUED)",null,null,null,null,null,null,null,null,null,null,null,null,null,null,null,"E.  PROGRAMS AND SERVICES FOR ELs AND THEIR FAMILIES (CONTINUED)",null,null,null,null,null,null,null,null,null,null,null,null,null,null,null,"E.  PROGRAMS AND SERVICES FOR ELs AND THEIR FAMILIES (CONTINUED)",null,null,null,null,null,null,null,null,null,null,null,null,null,null,null,"E.  PROGRAMS AND SERVICES FOR ELs AND THEIR FAMILIES (CONTINUED)",null,null,null,null,null,null,null,null,null,null,null,null,null,null,null,"E.  PROGRAMS AND SERVICES FOR ELs AND THEIR FAMILIES (CONTINUED)",null,null,null,null,null,null,null,null,null,null,null,null,null,null,null,"E.  PROGRAMS AND SERVICES FOR ELs AND THEIR FAMILIES (CONTINUED)",null,null,null,null,null,null,null,null,null,null,null,null,null,null,null,"E.  PROGRAMS AND SERVICES FOR ELs AND THEIR FAMILIES (CONTINUED)",null,null,null,null,null,null,null,null,null,null,null,null,null,null,null,"E.  PROGRAMS AND SERVICES FOR ELs AND THEIR FAMILIES (CONTINUED)",null,null,null,null,null,null,null,null,null,null,null,null,null,null,null,"E.  PROGRAMS AND SERVICES FOR ELs AND THEIR FAMILIES (CONTINUED)",null,null,null,null,null,null,null,null,null,null,null,null,null,null,null,"E.  PROGRAMS AND SERVICES FOR ELs AND THEIR FAMILIES (CONTINUED)",null,null,null,null,null,null,null,null,null,null,null,null,null,null,null,"E.  PROGRAMS AND SERVICES FOR ELs AND THEIR FAMILIES (CONTINUED)",null,null,null,null,null,null,null,null,null,null,null,null,null,null,null,"E.  PROGRAMS AND SERVICES FOR ELs AND THEIR FAMILIES (CONTINUED)",null,null,null,null,null,null,null,null,null,null,null,null,null,null,null,"E.  PROGRAMS AND SERVICES FOR ELs AND THEIR FAMILIES (CONTINUED)",null,null,null,null,null,null,null,null,null,null,null,null,null,null,null,"E.  PROGRAMS AND SERVICES FOR ELs AND THEIR FAMILIES (CONTINUED)",null,null,null,null,null,null,null,null,null,null,null,null,null,null,null,"E.  PROGRAMS AND SERVICES FOR ELs AND THEIR FAMILIES (CONTINUED)",null,null,null,null,null,null,null,null,null,null,null,null,null,null,null,"E.  PROGRAMS AND SERVICES FOR ELs AND THEIR FAMILIES (CONTINUED)",null,null,null,null,null,null,null,null,null,null,null,null,null,null,null,"E.  PROGRAMS AND SERVICES FOR ELs AND THEIR FAMILIES (CONTINUED)",null,null,null,null,null,null,null,null,null,null,null,null,null,null,null,"E.  PROGRAMS AND SERVICES FOR ELs AND THEIR FAMILIES (CONTINUED)",null,null,null,null,null,null,null,null,null,null,null,null,null,null,null,"E.  PROGRAMS AND SERVICES FOR ELs AND THEIR FAMILIES (CONTINUED)",null,null,null,null,null,null,null,null,null,null,null,null,null,null,null,"E.  PROGRAMS AND SERVICES FOR ELs AND THEIR FAMILIES (CONTINUED)",null,null,null,null,null,null,null,null,null,null,null,null,null,null,null,"E.  PROGRAMS AND SERVICES FOR ELs AND THEIR FAMILIES (CONTINUED)",null,null,null,null,null,null,null,null,null,null,null,null,null,null,null,"E.  PROGRAMS AND SERVICES FOR ELs AND THEIR FAMILIES (CONTINUED)",null,null,null,null,null,null,null,null,null,null,null,null,null,null,null,"E.  PROGRAMS AND SERVICES FOR ELs AND THEIR FAMILIES (CONTINUED)",null,null,null,null,null,null,null,null,null,null,null,null,null,null,null,"E.  PROGRAMS AND SERVICES FOR ELs AND THEIR FAMILIES (CONTINUED)",null,null,null,null,null,null,null,null,null,null,null,null,null,null,null,"E.  PROGRAMS AND SERVICES FOR ELs AND THEIR FAMILIES (CONTINUED)",null,null,null,null,null,null,null,null,null,null,null,null,null,null,null,"E.  PROGRAMS AND SERVICES FOR ELs AND THEIR FAMILIES (CONTINUED)",null,null,null,null,null,null,null,null,null,null,null,null,null,null,null,"E.  PROGRAMS AND SERVICES FOR ELs AND THEIR FAMILIES (CONTINUED)",null,null,null,null,null,null,null,null,null,null,null,null,null,null,null,"E.  PROGRAMS AND SERVICES FOR ELs AND THEIR FAMILIES (CONTINUED)",null,null,null,null,null,null,null,null,null,null,null,null,null,null,null,"E.  PROGRAMS AND SERVICES FOR ELs AND THEIR FAMILIES (CONTINUED)",null,null,null,null,null,null,null,null,null,null,null,null,null,null,null,"E.  PROGRAMS AND SERVICES FOR ELs AND THEIR FAMILIES (CONTINUED)",null,null,null,null,null,null,null,null,null,null,null,null,null,null,null,"E.  PROGRAMS AND SERVICES FOR ELs AND THEIR FAMILIES (CONTINUED)",null,null,null,null,null,null,null,null,null,null,null,null,null,null,null,"E.  PROGRAMS AND SERVICES FOR ELs AND THEIR FAMILIES (CONTINUED)",null,null,null,null,null,null,null,null,null,null,null,null,null,null,null,"E.  PROGRAMS AND SERVICES FOR ELs AND THEIR FAMILIES (CONTINUED)",null,null,null,null,null,null,null,null,null,null,null,null,null,null,null,"E.  PROGRAMS AND SERVICES FOR ELs AND THEIR FAMILIES (CONTINUED)",null,null,null,null,null,null,null,null,null,null,null,null,null,null,null,"E.  PROGRAMS AND SERVICES FOR ELs AND THEIR FAMILIES (CONTINUED)",null,null,null,null,null,null,null,null,null,null,null,null,null,null,null,"E.  PROGRAMS AND SERVICES FOR ELs AND THEIR FAMILIES (CONTINUED)",null,null,null,null,null,null,null,null,null,null,null,null,null,null,null,"E.  PROGRAMS AND SERVICES FOR ELs AND THEIR FAMILIES (CONTINUED)",null,null,null,null,null,null,null,null,null,null,null,null,null,null,null,"E.  PROGRAMS AND SERVICES FOR ELs AND THEIR FAMILIES (CONTINUED)",null,null,null,null,null,null,null,null,null,null,null,null,null,null,null,"E.  PROGRAMS AND SERVICES FOR ELs AND THEIR FAMILIES (CONTINUED)",null,null,null,null,null,null,null,null,null,null,null,null,null,null,null,"E.  PROGRAMS AND SERVICES FOR ELs AND THEIR FAMILIES (CONTINUED)",null,null,null,null,null,null,null,null,null,null,null,null,null,null,null,"E.  PROGRAMS AND SERVICES FOR ELs AND THEIR FAMILIES (CONTINUED)",null,null,null,null,null,null,null,null,null,null,null,null,null,null,null,"E.  PROGRAMS AND SERVICES FOR ELs AND THEIR FAMILIES (CONTINUED)",null,null,null,null,null,null,null,null,null,null,null,null,null,null,null,"E.  PROGRAMS AND SERVICES FOR ELs AND THEIR FAMILIES (CONTINUED)",null,null,null,null,null,null,null,null,null,null,null,null,null,null,null,"E.  PROGRAMS AND SERVICES FOR ELs AND THEIR FAMILIES (CONTINUED)",null,null,null,null,null,null,null,null,null,null,null,null,null,null,null,"E.  PROGRAMS AND SERVICES FOR ELs AND THEIR FAMILIES (CONTINUED)",null,null,null,null,null,null,null,null,null,null,null,null,null,null,null,"E.  PROGRAMS AND SERVICES FOR ELs AND THEIR FAMILIES (CONTINUED)",null,null,null,null,null,null,null,null,null,null,null,null,null,null,null,"E.  PROGRAMS AND SERVICES FOR ELs AND THEIR FAMILIES (CONTINUED)",null,null,null,null,null,null,null,null,null,null,null,null,null,null,null,"E.  PROGRAMS AND SERVICES FOR ELs AND THEIR FAMILIES (CONTINUED)",null,null,null,null,null,null,null,null,null,null,null,null,null,null,null,"E.  PROGRAMS AND SERVICES FOR ELs AND THEIR FAMILIES (CONTINUED)",null,null,null,null,null,null,null,null,null,null,null,null,null,null,null,"E.  PROGRAMS AND SERVICES FOR ELs AND THEIR FAMILIES (CONTINUED)",null,null,null,null,null,null,null,null,null,null,null,null,null,null,null,"E.  PROGRAMS AND SERVICES FOR ELs AND THEIR FAMILIES (CONTINUED)",null,null,null,null,null,null,null,null,null,null,null,null,null,null,null,"E.  PROGRAMS AND SERVICES FOR ELs AND THEIR FAMILIES (CONTINUED)",null,null,null,null,null,null,null,null,null,null,null,null,null,null,null,"E.  PROGRAMS AND SERVICES FOR ELs AND THEIR FAMILIES (CONTINUED)",null,null,null,null,null,null,null,null,null,null,null,null,null,null,null,"E.  PROGRAMS AND SERVICES FOR ELs AND THEIR FAMILIES (CONTINUED)",null,null,null,null,null,null,null,null,null,null,null,null,null,null,null,"E.  PROGRAMS AND SERVICES FOR ELs AND THEIR FAMILIES (CONTINUED)",null,null,null,null,null,null,null,null,null,null,null,null,null,null,null,"E.  PROGRAMS AND SERVICES FOR ELs AND THEIR FAMILIES (CONTINUED)",null,null,null,null,null,null,null,null,null,null,null,null,null,null,null,"E.  PROGRAMS AND SERVICES FOR ELs AND THEIR FAMILIES (CONTINUED)",null,null,null,null,null,null,null,null,null,null,null,null,null,null,null,"E.  PROGRAMS AND SERVICES FOR ELs AND THEIR FAMILIES (CONTINUED)",null,null,null,null,null,null,null,null,null,null,null,null,null,null,null,"E.  PROGRAMS AND SERVICES FOR ELs AND THEIR FAMILIES (CONTINUED)",null,null,null,null,null,null,null,null,null,null,null,null,null,null,null,"E.  PROGRAMS AND SERVICES FOR ELs AND THEIR FAMILIES (CONTINUED)",null,null,null,null,null,null,null,null,null,null,null,null,null,null,null,"E.  PROGRAMS AND SERVICES FOR ELs AND THEIR FAMILIES (CONTINUED)",null,null,null,null,null,null,null,null,null,null,null,null,null,null,null,"E.  PROGRAMS AND SERVICES FOR ELs AND THEIR FAMILIES (CONTINUED)",null,null,null,null,null,null,null,null,null,null,null,null,null,null,null,"E.  PROGRAMS AND SERVICES FOR ELs AND THEIR FAMILIES (CONTINUED)",null,null,null,null,null,null,null,null,null,null,null,null,null,null,null,"E.  PROGRAMS AND SERVICES FOR ELs AND THEIR FAMILIES (CONTINUED)",null,null,null,null,null,null,null,null,null,null,null,null,null,null,null,"E.  PROGRAMS AND SERVICES FOR ELs AND THEIR FAMILIES (CONTINUED)",null,null,null,null,null,null,null,null,null,null,null,null,null,null,null,"E.  PROGRAMS AND SERVICES FOR ELs AND THEIR FAMILIES (CONTINUED)",null,null,null,null,null,null,null,null,null,null,null,null,null,null,null,"E.  PROGRAMS AND SERVICES FOR ELs AND THEIR FAMILIES (CONTINUED)",null,null,null,null,null,null,null,null,null,null,null,null,null,null,null,"E.  PROGRAMS AND SERVICES FOR ELs AND THEIR FAMILIES (CONTINUED)",null,null,null,null,null,null,null,null,null,null,null,null,null,null,null,"E.  PROGRAMS AND SERVICES FOR ELs AND THEIR FAMILIES (CONTINUED)",null,null,null,null,null,null,null,null,null,null,null,null,null,null,null,"E.  PROGRAMS AND SERVICES FOR ELs AND THEIR FAMILIES (CONTINUED)",null,null,null,null,null,null,null,null,null,null,null,null,null,null,null,"E.  PROGRAMS AND SERVICES FOR ELs AND THEIR FAMILIES (CONTINUED)",null,null,null,null,null,null,null,null,null,null,null,null,null,null,null,"E.  PROGRAMS AND SERVICES FOR ELs AND THEIR FAMILIES (CONTINUED)",null,null,null,null,null,null,null,null,null,null,null,null,null,null,null,"E.  PROGRAMS AND SERVICES FOR ELs AND THEIR FAMILIES (CONTINUED)",null,null,null,null,null,null,null,null,null,null,null,null,null,null,null,"E.  PROGRAMS AND SERVICES FOR ELs AND THEIR FAMILIES (CONTINUED)",null,null,null,null,null,null,null,null,null,null,null,null,null,null,null,"E.  PROGRAMS AND SERVICES FOR ELs AND THEIR FAMILIES (CONTINUED)",null,null,null,null,null,null,null,null,null,null,null,null,null,null,null,"E.  PROGRAMS AND SERVICES FOR ELs AND THEIR FAMILIES (CONTINUED)",null,null,null,null,null,null,null,null,null,null,null,null,null,null,null,"E.  PROGRAMS AND SERVICES FOR ELs AND THEIR FAMILIES (CONTINUED)",null,null,null,null,null,null,null,null,null,null,null,null,null,null,null,"E.  PROGRAMS AND SERVICES FOR ELs AND THEIR FAMILIES (CONTINUED)",null,null,null,null,null,null,null,null,null,null,null,null,null,null,null,"E.  PROGRAMS AND SERVICES FOR ELs AND THEIR FAMILIES (CONTINUED)",null,null,null,null,null,null,null,null,null,null,null,null,null,null,null,"E.  PROGRAMS AND SERVICES FOR ELs AND THEIR FAMILIES (CONTINUED)",null,null,null,null,null,null,null,null,null,null,null,null,null,null,null,"E.  PROGRAMS AND SERVICES FOR ELs AND THEIR FAMILIES (CONTINUED)",null,null,null,null,null,null,null,null,null,null,null,null,null,null,null,"E.  PROGRAMS AND SERVICES FOR ELs AND THEIR FAMILIES (CONTINUED)",null,null,null,null,null,null,null,null,null,null,null,null,null,null,null,"E.  PROGRAMS AND SERVICES FOR ELs AND THEIR FAMILIES (CONTINUED)",null,null,null,null,null,null,null,null,null,null,null,null,null,null,null,"E.  PROGRAMS AND SERVICES FOR ELs AND THEIR FAMILIES (CONTINUED)",null,null,null,null,null,null,null,null,null,null,null,null,null,null,null,"E.  PROGRAMS AND SERVICES FOR ELs AND THEIR FAMILIES (CONTINUED)",null,null,null,null,null,null,null,null,null,null,null,null,null,null,null,"E.  PROGRAMS AND SERVICES FOR ELs AND THEIR FAMILIES (CONTINUED)",null,null,null,null,null,null,null,null,null,null,null,null,null,null,null,"E.  PROGRAMS AND SERVICES FOR ELs AND THEIR FAMILIES (CONTINUED)",null,null,null,null,null,null,null,null,null,null,null,null,null,null,null,"E.  PROGRAMS AND SERVICES FOR ELs AND THEIR FAMILIES (CONTINUED)",null,null,null,null,null,null,null,null,null,null,null,null,null,null,null,"E.  PROGRAMS AND SERVICES FOR ELs AND THEIR FAMILIES (CONTINUED)",null,null,null,null,null,null,null,null,null,null,null,null,null,null,null,"E.  PROGRAMS AND SERVICES FOR ELs AND THEIR FAMILIES (CONTINUED)",null,null,null,null,null,null,null,null,null,null,null,null,null,null,null,"E.  PROGRAMS AND SERVICES FOR ELs AND THEIR FAMILIES (CONTINUED)",null,null,null,null,null,null,null,null,null,null,null,null,null,null,null,"E.  PROGRAMS AND SERVICES FOR ELs AND THEIR FAMILIES (CONTINUED)",null,null,null,null,null,null,null,null,null,null,null,null,null,null,null,"E.  PROGRAMS AND SERVICES FOR ELs AND THEIR FAMILIES (CONTINUED)",null,null,null,null,null,null,null,null,null,null,null,null,null,null,null,"E.  PROGRAMS AND SERVICES FOR ELs AND THEIR FAMILIES (CONTINUED)",null,null,null,null,null,null,null,null,null,null,null,null,null,null,null,"E.  PROGRAMS AND SERVICES FOR ELs AND THEIR FAMILIES (CONTINUED)",null,null,null,null,null,null,null,null,null,null,null,null,null,null,null,"E.  PROGRAMS AND SERVICES FOR ELs AND THEIR FAMILIES (CONTINUED)",null,null,null,null,null,null,null,null,null,null,null,null,null,null,null,"E.  PROGRAMS AND SERVICES FOR ELs AND THEIR FAMILIES (CONTINUED)",null,null,null,null,null,null,null,null,null,null,null,null,null,null,null,"E.  PROGRAMS AND SERVICES FOR ELs AND THEIR FAMILIES (CONTINUED)",null,null,null,null,null,null,null,null,null,null,null,null,null,null,null,"E.  PROGRAMS AND SERVICES FOR ELs AND THEIR FAMILIES (CONTINUED)",null,null,null,null,null,null,null,null,null,null,null,null,null,null,null,"E.  PROGRAMS AND SERVICES FOR ELs AND THEIR FAMILIES (CONTINUED)",null,null,null,null,null,null,null,null,null,null,null,null,null,null,null,"E.  PROGRAMS AND SERVICES FOR ELs AND THEIR FAMILIES (CONTINUED)",null,null,null,null,null,null,null,null,null,null,null,null,null,null,null,"E.  PROGRAMS AND SERVICES FOR ELs AND THEIR FAMILIES (CONTINUED)",null,null,null,null,null,null,null,null,null,null,null,null,null,null,null,"E.  PROGRAMS AND SERVICES FOR ELs AND THEIR FAMILIES (CONTINUED)",null,null,null,null,null,null,null,null,null,null,null,null,null,null,null,"E.  PROGRAMS AND SERVICES FOR ELs AND THEIR FAMILIES (CONTINUED)",null,null,null,null,null,null,null,null,null,null,null,null,null,null,null,"E.  PROGRAMS AND SERVICES FOR ELs AND THEIR FAMILIES (CONTINUED)",null,null,null,null,null,null,null,null,null,null,null,null,null,null,null,"E.  PROGRAMS AND SERVICES FOR ELs AND THEIR FAMILIES (CONTINUED)",null,null,null,null,null,null,null,null,null,null,null,null,null,null,null,"E.  PROGRAMS AND SERVICES FOR ELs AND THEIR FAMILIES (CONTINUED)",null,null,null,null,null,null,null,null,null,null,null,null,null,null,null,"E.  PROGRAMS AND SERVICES FOR ELs AND THEIR FAMILIES (CONTINUED)",null,null,null,null,null,null,null,null,null,null,null,null,null,null,null,"E.  PROGRAMS AND SERVICES FOR ELs AND THEIR FAMILIES (CONTINUED)",null,null,null,null,null,null,null,null,null,null,null,null,null,null,null,"E.  PROGRAMS AND SERVICES FOR ELs AND THEIR FAMILIES (CONTINUED)",null,null,null,null,null,null,null,null,null,null,null,null,null,null,null,"E.  PROGRAMS AND SERVICES FOR ELs AND THEIR FAMILIES (CONTINUED)",null,null,null,null,null,null,null,null,null,null,null,null,null,null,null,"E.  PROGRAMS AND SERVICES FOR ELs AND THEIR FAMILIES (CONTINUED)",null,null,null,null,null,null,null,null,null,null,null,null,null,null,null,"E.  PROGRAMS AND SERVICES FOR ELs AND THEIR FAMILIES (CONTINUED)",null,null,null,null,null,null,null,null,null,null,null,null,null,null,null,"E.  PROGRAMS AND SERVICES FOR ELs AND THEIR FAMILIES (CONTINUED)",null,null,null,null,null,null,null,null,null,null,null,null,null,null,null,"E.  PROGRAMS AND SERVICES FOR ELs AND THEIR FAMILIES (CONTINUED)",null,null,null,null,null,null,null,null,null,null,null,null,null,null,null,"E.  PROGRAMS AND SERVICES FOR ELs AND THEIR FAMILIES (CONTINUED)",null,null,null,null,null,null,null,null,null,null,null,null,null,null,null,"E.  PROGRAMS AND SERVICES FOR ELs AND THEIR FAMILIES (CONTINUED)",null,null,null,null,null,null,null,null,null,null,null,null,null,null,null,"E.  PROGRAMS AND SERVICES FOR ELs AND THEIR FAMILIES (CONTINUED)",null,null,null,null,null,null,null,null,null,null,null,null,null,null,null,"E.  PROGRAMS AND SERVICES FOR ELs AND THEIR FAMILIES (CONTINUED)",null,null,null,null,null,null,null,null,null,null,null,null,null,null,null,"E.  PROGRAMS AND SERVICES FOR ELs AND THEIR FAMILIES (CONTINUED)",null,null,null,null,null,null,null,null,null,null,null,null,null,null,null,"E.  PROGRAMS AND SERVICES FOR ELs AND THEIR FAMILIES (CONTINUED)",null,null,null,null,null,null,null,null,null,null,null,null,null,null,null,"E.  PROGRAMS AND SERVICES FOR ELs AND THEIR FAMILIES (CONTINUED)",null,null,null,null,null,null,null,null,null,null,null,null,null,null,null,"E.  PROGRAMS AND SERVICES FOR ELs AND THEIR FAMILIES (CONTINUED)",null,null,null,null,null,null,null,null,null,null,null,null,null,null,null,"E.  PROGRAMS AND SERVICES FOR ELs AND THEIR FAMILIES (CONTINUED)",null,null,null,null,null,null,null,null,null,null,null,null,null,null,null,"E.  PROGRAMS AND SERVICES FOR ELs AND THEIR FAMILIES (CONTINUED)",null,null,null,null,null,null,null,null,null,null,null,null,null,null,null,"E.  PROGRAMS AND SERVICES FOR ELs AND THEIR FAMILIES (CONTINUED)",null,null,null,null,null,null,null,null,null,null,null,null,null,null,null,"E.  PROGRAMS AND SERVICES FOR ELs AND THEIR FAMILIES (CONTINUED)",null,null,null,null,null,null,null,null,null,null,null,null,null,null,null,"E.  PROGRAMS AND SERVICES FOR ELs AND THEIR FAMILIES (CONTINUED)",null,null,null,null,null,null,null,null,null,null,null,null,null,null,null,"E.  PROGRAMS AND SERVICES FOR ELs AND THEIR FAMILIES (CONTINUED)",null,null,null,null,null,null,null,null,null,null,null,null,null,null,null,"E.  PROGRAMS AND SERVICES FOR ELs AND THEIR FAMILIES (CONTINUED)",null,null,null,null,null,null,null,null,null,null,null,null,null,null,null,"E.  PROGRAMS AND SERVICES FOR ELs AND THEIR FAMILIES (CONTINUED)",null,null,null,null,null,null,null,null,null,null,null,null,null,null,null,"E.  PROGRAMS AND SERVICES FOR ELs AND THEIR FAMILIES (CONTINUED)",null,null,null,null,null,null,null,null,null,null,null,null,null,null,null,"E.  PROGRAMS AND SERVICES FOR ELs AND THEIR FAMILIES (CONTINUED)",null,null,null,null,null,null,null,null,null,null,null,null,null,null,null,"E.  PROGRAMS AND SERVICES FOR ELs AND THEIR FAMILIES (CONTINUED)",null,null,null,null,null,null,null,null,null,null,null,null,null,null,null,"E.  PROGRAMS AND SERVICES FOR ELs AND THEIR FAMILIES (CONTINUED)",null,null,null,null,null,null,null,null,null,null,null,null,null,null,null,"E.  PROGRAMS AND SERVICES FOR ELs AND THEIR FAMILIES (CONTINUED)",null,null,null,null,null,null,null,null,null,null,null,null,null,null,null,"E.  PROGRAMS AND SERVICES FOR ELs AND THEIR FAMILIES (CONTINUED)",null,null,null,null,null,null,null,null,null,null,null,null,null,null,null,"E.  PROGRAMS AND SERVICES FOR ELs AND THEIR FAMILIES (CONTINUED)",null,null,null,null,null,null,null,null,null,null,null,null,null,null,null,"E.  PROGRAMS AND SERVICES FOR ELs AND THEIR FAMILIES (CONTINUED)",null,null,null,null,null,null,null,null,null,null,null,null,null,null,null,"E.  PROGRAMS AND SERVICES FOR ELs AND THEIR FAMILIES (CONTINUED)",null,null,null,null,null,null,null,null,null,null,null,null,null,null,null,"E.  PROGRAMS AND SERVICES FOR ELs AND THEIR FAMILIES (CONTINUED)",null,null,null,null,null,null,null,null,null,null,null,null,null,null,null,"E.  PROGRAMS AND SERVICES FOR ELs AND THEIR FAMILIES (CONTINUED)",null,null,null,null,null,null,null,null,null,null,null,null,null,null,null,"E.  PROGRAMS AND SERVICES FOR ELs AND THEIR FAMILIES (CONTINUED)",null,null,null,null,null,null,null,null,null,null,null,null,null,null,null,"E.  PROGRAMS AND SERVICES FOR ELs AND THEIR FAMILIES (CONTINUED)",null,null,null,null,null,null,null,null,null,null,null,null,null,null,null,"E.  PROGRAMS AND SERVICES FOR ELs AND THEIR FAMILIES (CONTINUED)",null,null,null,null,null,null,null,null,null,null,null,null,null,null,null,"E.  PROGRAMS AND SERVICES FOR ELs AND THEIR FAMILIES (CONTINUED)",null,null,null,null,null,null,null,null,null,null,null,null,null,null,null,"E.  PROGRAMS AND SERVICES FOR ELs AND THEIR FAMILIES (CONTINUED)",null,null,null,null,null,null,null,null,null,null,null,null,null,null,null,"E.  PROGRAMS AND SERVICES FOR ELs AND THEIR FAMILIES (CONTINUED)",null,null,null,null,null,null,null,null,null,null,null,null,null,null,null,"E.  PROGRAMS AND SERVICES FOR ELs AND THEIR FAMILIES (CONTINUED)",null,null,null,null,null,null,null,null,null,null,null,null,null,null,null,"E.  PROGRAMS AND SERVICES FOR ELs AND THEIR FAMILIES (CONTINUED)",null,null,null,null,null,null,null,null,null,null,null,null,null,null,null,"E.  PROGRAMS AND SERVICES FOR ELs AND THEIR FAMILIES (CONTINUED)",null,null,null,null,null,null,null,null,null,null,null,null,null,null,null,"E.  PROGRAMS AND SERVICES FOR ELs AND THEIR FAMILIES (CONTINUED)",null,null,null,null,null,null,null,null,null,null,null,null,null,null,null,"E.  PROGRAMS AND SERVICES FOR ELs AND THEIR FAMILIES (CONTINUED)",null,null,null,null,null,null,null,null,null,null,null,null,null,null,null,"E.  PROGRAMS AND SERVICES FOR ELs AND THEIR FAMILIES (CONTINUED)",null,null,null,null,null,null,null,null,null,null,null,null,null,null,null,"E.  PROGRAMS AND SERVICES FOR ELs AND THEIR FAMILIES (CONTINUED)",null,null,null,null,null,null,null,null,null,null,null,null,null,null,null,"E.  PROGRAMS AND SERVICES FOR ELs AND THEIR FAMILIES (CONTINUED)",null,null,null,null,null,null,null,null,null,null,null,null,null,null,null,"E.  PROGRAMS AND SERVICES FOR ELs AND THEIR FAMILIES (CONTINUED)",null,null,null,null,null,null,null,null,null,null,null,null,null,null,null,"E.  PROGRAMS AND SERVICES FOR ELs AND THEIR FAMILIES (CONTINUED)",null,null,null,null,null,null,null,null,null,null,null,null,null,null,null,"E.  PROGRAMS AND SERVICES FOR ELs AND THEIR FAMILIES (CONTINUED)",null,null,null,null,null,null,null,null,null,null,null,null,null,null,null,"E.  PROGRAMS AND SERVICES FOR ELs AND THEIR FAMILIES (CONTINUED)",null,null,null,null,null,null,null,null,null,null,null,null,null,null,null,"E.  PROGRAMS AND SERVICES FOR ELs AND THEIR FAMILIES (CONTINUED)",null,null,null,null,null,null,null,null,null,null,null,null,null,null,null,"E.  PROGRAMS AND SERVICES FOR ELs AND THEIR FAMILIES (CONTINUED)",null,null,null,null,null,null,null,null,null,null,null,null,null,null,null,"E.  PROGRAMS AND SERVICES FOR ELs AND THEIR FAMILIES (CONTINUED)",null,null,null,null,null,null,null,null,null,null,null,null,null,null,null,"E.  PROGRAMS AND SERVICES FOR ELs AND THEIR FAMILIES (CONTINUED)",null,null,null,null,null,null,null,null,null,null,null,null,null,null,null,"E.  PROGRAMS AND SERVICES FOR ELs AND THEIR FAMILIES (CONTINUED)",null,null,null,null,null,null,null,null,null,null,null,null,null,null,null,"E.  PROGRAMS AND SERVICES FOR ELs AND THEIR FAMILIES (CONTINUED)",null,null,null,null,null,null,null,null,null,null,null,null,null,null,null,"E.  PROGRAMS AND SERVICES FOR ELs AND THEIR FAMILIES (CONTINUED)",null,null,null,null,null,null,null,null,null,null,null,null,null,null,null,"E.  PROGRAMS AND SERVICES FOR ELs AND THEIR FAMILIES (CONTINUED)",null,null,null,null,null,null,null,null,null,null,null,null,null,null,null,"E.  PROGRAMS AND SERVICES FOR ELs AND THEIR FAMILIES (CONTINUED)",null,null,null,null,null,null,null,null,null,null,null,null,null,null,null,"E.  PROGRAMS AND SERVICES FOR ELs AND THEIR FAMILIES (CONTINUED)",null,null,null,null,null,null,null,null,null,null,null,null,null,null,null,"E.  PROGRAMS AND SERVICES FOR ELs AND THEIR FAMILIES (CONTINUED)",null,null,null,null,null,null,null,null,null,null,null,null,null,null,null,"E.  PROGRAMS AND SERVICES FOR ELs AND THEIR FAMILIES (CONTINUED)",null,null,null,null,null,null,null,null,null,null,null,null,null,null,null,"E.  PROGRAMS AND SERVICES FOR ELs AND THEIR FAMILIES (CONTINUED)",null,null,null,null,null,null,null,null,null,null,null,null,null,null,null,"E.  PROGRAMS AND SERVICES FOR ELs AND THEIR FAMILIES (CONTINUED)",null,null,null,null,null,null,null,null,null,null,null,null,null,null,null,"E.  PROGRAMS AND SERVICES FOR ELs AND THEIR FAMILIES (CONTINUED)",null,null,null,null,null,null,null,null,null,null,null,null,null,null,null,"E.  PROGRAMS AND SERVICES FOR ELs AND THEIR FAMILIES (CONTINUED)",null,null,null,null,null,null,null,null,null,null,null,null,null,null,null,"E.  PROGRAMS AND SERVICES FOR ELs AND THEIR FAMILIES (CONTINUED)",null,null,null,null,null,null,null,null,null,null,null,null,null,null,null,"E.  PROGRAMS AND SERVICES FOR ELs AND THEIR FAMILIES (CONTINUED)",null,null,null,null,null,null,null,null,null,null,null,null,null,null,null,"E.  PROGRAMS AND SERVICES FOR ELs AND THEIR FAMILIES (CONTINUED)",null,null,null,null,null,null,null,null,null,null,null,null,null,null,null,"E.  PROGRAMS AND SERVICES FOR ELs AND THEIR FAMILIES (CONTINUED)",null,null,null,null,null,null,null,null,null,null,null,null,null,null,null,"E.  PROGRAMS AND SERVICES FOR ELs AND THEIR FAMILIES (CONTINUED)",null,null,null,null,null,null,null,null,null,null,null,null,null,null,null,"E.  PROGRAMS AND SERVICES FOR ELs AND THEIR FAMILIES (CONTINUED)",null,null,null,null,null,null,null,null,null,null,null,null,null,null,null,"E.  PROGRAMS AND SERVICES FOR ELs AND THEIR FAMILIES (CONTINUED)",null,null,null,null,null,null,null,null,null,null,null,null,null,null,null,"E.  PROGRAMS AND SERVICES FOR ELs AND THEIR FAMILIES (CONTINUED)",null,null,null,null,null,null,null,null,null,null,null,null,null,null,null,"E.  PROGRAMS AND SERVICES FOR ELs AND THEIR FAMILIES (CONTINUED)",null,null,null,null,null,null,null,null,null,null,null,null,null,null,null,"E.  PROGRAMS AND SERVICES FOR ELs AND THEIR FAMILIES (CONTINUED)",null,null,null,null,null,null,null,null,null,null,null,null,null,null,null,"E.  PROGRAMS AND SERVICES FOR ELs AND THEIR FAMILIES (CONTINUED)",null,null,null,null,null,null,null,null,null,null,null,null,null,null,null,"E.  PROGRAMS AND SERVICES FOR ELs AND THEIR FAMILIES (CONTINUED)",null,null,null,null,null,null,null,null,null,null,null,null,null,null,null,"E.  PROGRAMS AND SERVICES FOR ELs AND THEIR FAMILIES (CONTINUED)",null,null,null,null,null,null,null,null,null,null,null,null,null,null,null,"E.  PROGRAMS AND SERVICES FOR ELs AND THEIR FAMILIES (CONTINUED)",null,null,null,null,null,null,null,null,null,null,null,null,null,null,null,"E.  PROGRAMS AND SERVICES FOR ELs AND THEIR FAMILIES (CONTINUED)",null,null,null,null,null,null,null,null,null,null,null,null,null,null,null,"E.  PROGRAMS AND SERVICES FOR ELs AND THEIR FAMILIES (CONTINUED)",null,null,null,null,null,null,null,null,null,null,null,null,null,null,null,"E.  PROGRAMS AND SERVICES FOR ELs AND THEIR FAMILIES (CONTINUED)",null,null,null,null,null,null,null,null,null,null,null,null,null,null,null,"E.  PROGRAMS AND SERVICES FOR ELs AND THEIR FAMILIES (CONTINUED)",null,null,null,null,null,null,null,null,null,null,null,null,null,null,null,"E.  PROGRAMS AND SERVICES FOR ELs AND THEIR FAMILIES (CONTINUED)",null,null,null,null,null,null,null,null,null,null,null,null,null,null,null,"E.  PROGRAMS AND SERVICES FOR ELs AND THEIR FAMILIES (CONTINUED)",null,null,null,null,null,null,null,null,null,null,null,null,null,null,null,"E.  PROGRAMS AND SERVICES FOR ELs AND THEIR FAMILIES (CONTINUED)",null,null,null,null,null,null,null,null,null,null,null,null,null,null,null,"E.  PROGRAMS AND SERVICES FOR ELs AND THEIR FAMILIES (CONTINUED)",null,null,null,null,null,null,null,null,null,null,null,null,null,null,null,"E.  PROGRAMS AND SERVICES FOR ELs AND THEIR FAMILIES (CONTINUED)",null,null,null,null,null,null,null,null,null,null,null,null,null,null,null,"E.  PROGRAMS AND SERVICES FOR ELs AND THEIR FAMILIES (CONTINUED)",null,null,null,null,null,null,null,null,null,null,null,null,null,null,null,"E.  PROGRAMS AND SERVICES FOR ELs AND THEIR FAMILIES (CONTINUED)",null,null,null,null,null,null,null,null,null,null,null,null,null,null,null,"E.  PROGRAMS AND SERVICES FOR ELs AND THEIR FAMILIES (CONTINUED)",null,null,null,null,null,null,null,null,null,null,null,null,null,null,null,"E.  PROGRAMS AND SERVICES FOR ELs AND THEIR FAMILIES (CONTINUED)",null,null,null,null,null,null,null,null,null,null,null,null,null,null,null,"E.  PROGRAMS AND SERVICES FOR ELs AND THEIR FAMILIES (CONTINUED)",null,null,null,null,null,null,null,null,null,null,null,null,null,null,null,"E.  PROGRAMS AND SERVICES FOR ELs AND THEIR FAMILIES (CONTINUED)",null,null,null,null,null,null,null,null,null,null,null,null,null,null,null,"E.  PROGRAMS AND SERVICES FOR ELs AND THEIR FAMILIES (CONTINUED)",null,null,null,null,null,null,null,null,null,null,null,null,null,null,null,"E.  PROGRAMS AND SERVICES FOR ELs AND THEIR FAMILIES (CONTINUED)",null,null,null,null,null,null,null,null,null,null,null,null,null,null,null,"E.  PROGRAMS AND SERVICES FOR ELs AND THEIR FAMILIES (CONTINUED)",null,null,null,null,null,null,null,null,null,null,null,null,null,null,null,"E.  PROGRAMS AND SERVICES FOR ELs AND THEIR FAMILIES (CONTINUED)",null,null,null,null,null,null,null,null,null,null,null,null,null,null,null,"E.  PROGRAMS AND SERVICES FOR ELs AND THEIR FAMILIES (CONTINUED)",null,null,null,null,null,null,null,null,null,null,null,null,null,null,null,"E.  PROGRAMS AND SERVICES FOR ELs AND THEIR FAMILIES (CONTINUED)",null,null,null,null,null,null,null,null,null,null,null,null,null,null,null,"E.  PROGRAMS AND SERVICES FOR ELs AND THEIR FAMILIES (CONTINUED)",null,null,null,null,null,null,null,null,null,null,null,null,null,null,null,"E.  PROGRAMS AND SERVICES FOR ELs AND THEIR FAMILIES (CONTINUED)",null,null,null,null,null,null,null,null,null,null,null,null,null,null,null,"E.  PROGRAMS AND SERVICES FOR ELs AND THEIR FAMILIES (CONTINUED)",null,null,null,null,null,null,null,null,null,null,null,null,null,null,null,"E.  PROGRAMS AND SERVICES FOR ELs AND THEIR FAMILIES (CONTINUED)",null,null,null,null,null,null,null,null,null,null,null,null,null,null,null,"E.  PROGRAMS AND SERVICES FOR ELs AND THEIR FAMILIES (CONTINUED)",null,null,null,null,null,null,null,null,null,null,null,null,null,null,null,"E.  PROGRAMS AND SERVICES FOR ELs AND THEIR FAMILIES (CONTINUED)",null,null,null,null,null,null,null,null,null,null,null,null,null,null,null,"E.  PROGRAMS AND SERVICES FOR ELs AND THEIR FAMILIES (CONTINUED)",null,null,null,null,null,null,null,null,null,null,null,null,null,null,null,"E.  PROGRAMS AND SERVICES FOR ELs AND THEIR FAMILIES (CONTINUED)",null,null,null,null,null,null,null,null,null,null,null,null,null,null,null,"E.  PROGRAMS AND SERVICES FOR ELs AND THEIR FAMILIES (CONTINUED)",null,null,null,null,null,null,null,null,null,null,null,null,null,null,null,"E.  PROGRAMS AND SERVICES FOR ELs AND THEIR FAMILIES (CONTINUED)",null,null,null,null,null,null,null,null,null,null,null,null,null,null,null,"E.  PROGRAMS AND SERVICES FOR ELs AND THEIR FAMILIES (CONTINUED)",null,null,null,null,null,null,null,null,null,null,null,null,null,null,null,"E.  PROGRAMS AND SERVICES FOR ELs AND THEIR FAMILIES (CONTINUED)",null,null,null,null,null,null,null,null,null,null,null,null,null,null,null,"E.  PROGRAMS AND SERVICES FOR ELs AND THEIR FAMILIES (CONTINUED)",null,null,null,null,null,null,null,null,null,null,null,null,null,null,null,"E.  PROGRAMS AND SERVICES FOR ELs AND THEIR FAMILIES (CONTINUED)",null,null,null,null,null,null,null,null,null,null,null,null,null,null,null,"E.  PROGRAMS AND SERVICES FOR ELs AND THEIR FAMILIES (CONTINUED)",null,null,null,null,null,null,null,null,null,null,null,null,null,null,null,"E.  PROGRAMS AND SERVICES FOR ELs AND THEIR FAMILIES (CONTINUED)",null,null,null,null,null,null,null,null,null,null,null,null,null,null,null,"E.  PROGRAMS AND SERVICES FOR ELs AND THEIR FAMILIES (CONTINUED)",null,null,null,null,null,null,null,null,null,null,null,null,null,null,null,"E.  PROGRAMS AND SERVICES FOR ELs AND THEIR FAMILIES (CONTINUED)",null,null,null,null,null,null,null,null,null,null,null,null,null,null,null,"E.  PROGRAMS AND SERVICES FOR ELs AND THEIR FAMILIES (CONTINUED)",null,null,null,null,null,null,null,null,null,null,null,null,null,null,null,"E.  PROGRAMS AND SERVICES FOR ELs AND THEIR FAMILIES (CONTINUED)",null,null,null,null,null,null,null,null,null,null,null,null,null,null,null,"E.  PROGRAMS AND SERVICES FOR ELs AND THEIR FAMILIES (CONTINUED)",null,null,null,null,null,null,null,null,null,null,null,null,null,null,null,"E.  PROGRAMS AND SERVICES FOR ELs AND THEIR FAMILIES (CONTINUED)",null,null,null,null,null,null,null,null,null,null,null,null,null,null,null,"E.  PROGRAMS AND SERVICES FOR ELs AND THEIR FAMILIES (CONTINUED)",null,null,null,null,null,null,null,null,null,null,null,null,null,null,null,"E.  PROGRAMS AND SERVICES FOR ELs AND THEIR FAMILIES (CONTINUED)",null,null,null,null,null,null,null,null,null,null,null,null,null,null,null,"E.  PROGRAMS AND SERVICES FOR ELs AND THEIR FAMILIES (CONTINUED)",null,null,null,null,null,null,null,null,null,null,null,null,null,null,null,"E.  PROGRAMS AND SERVICES FOR ELs AND THEIR FAMILIES (CONTINUED)",null,null,null,null,null,null,null,null,null,null,null,null,null,null,null,"E.  PROGRAMS AND SERVICES FOR ELs AND THEIR FAMILIES (CONTINUED)",null,null,null,null,null,null,null,null,null,null,null,null,null,null,null,"E.  PROGRAMS AND SERVICES FOR ELs AND THEIR FAMILIES (CONTINUED)",null,null,null,null,null,null,null,null,null,null,null,null,null,null,null,"E.  PROGRAMS AND SERVICES FOR ELs AND THEIR FAMILIES (CONTINUED)",null,null,null,null,null,null,null,null,null,null,null,null,null,null,null,"E.  PROGRAMS AND SERVICES FOR ELs AND THEIR FAMILIES (CONTINUED)",null,null,null,null,null,null,null,null,null,null,null,null,null,null,null,"E.  PROGRAMS AND SERVICES FOR ELs AND THEIR FAMILIES (CONTINUED)",null,null,null,null,null,null,null,null,null,null,null,null,null,null,null,"E.  PROGRAMS AND SERVICES FOR ELs AND THEIR FAMILIES (CONTINUED)",null,null,null,null,null,null,null,null,null,null,null,null,null,null,null,"E.  PROGRAMS AND SERVICES FOR ELs AND THEIR FAMILIES (CONTINUED)",null,null,null,null,null,null,null,null,null,null,null,null,null,null,null,"E.  PROGRAMS AND SERVICES FOR ELs AND THEIR FAMILIES (CONTINUED)",null,null,null,null,null,null,null,null,null,null,null,null,null,null,null,"E.  PROGRAMS AND SERVICES FOR ELs AND THEIR FAMILIES (CONTINUED)",null,null,null,null,null,null,null,null,null,null,null,null,null,null,null,"E.  PROGRAMS AND SERVICES FOR ELs AND THEIR FAMILIES (CONTINUED)",null,null,null,null,null,null,null,null,null,null,null,null,null,null,null,"E.  PROGRAMS AND SERVICES FOR ELs AND THEIR FAMILIES (CONTINUED)",null,null,null,null,null,null,null,null,null,null,null,null,null,null,null,"E.  PROGRAMS AND SERVICES FOR ELs AND THEIR FAMILIES (CONTINUED)",null,null,null,null,null,null,null,null,null,null,null,null,null,null,null,"E.  PROGRAMS AND SERVICES FOR ELs AND THEIR FAMILIES (CONTINUED)",null,null,null,null,null,null,null,null,null,null,null,null,null,null,null,"E.  PROGRAMS AND SERVICES FOR ELs AND THEIR FAMILIES (CONTINUED)",null,null,null,null,null,null,null,null,null,null,null,null,null,null,null,"E.  PROGRAMS AND SERVICES FOR ELs AND THEIR FAMILIES (CONTINUED)",null,null,null,null,null,null,null,null,null,null,null,null,null,null,null,"E.  PROGRAMS AND SERVICES FOR ELs AND THEIR FAMILIES (CONTINUED)",null,null,null,null,null,null,null,null,null,null,null,null,null,null,null,"E.  PROGRAMS AND SERVICES FOR ELs AND THEIR FAMILIES (CONTINUED)",null,null,null,null,null,null,null,null,null,null,null,null,null,null,null,"E.  PROGRAMS AND SERVICES FOR ELs AND THEIR FAMILIES (CONTINUED)",null,null,null,null,null,null,null,null,null,null,null,null,null,null,null,"E.  PROGRAMS AND SERVICES FOR ELs AND THEIR FAMILIES (CONTINUED)",null,null,null,null,null,null,null,null,null,null,null,null,null,null,null,"E.  PROGRAMS AND SERVICES FOR ELs AND THEIR FAMILIES (CONTINUED)",null,null,null,null,null,null,null,null,null,null,null,null,null,null,null,"E.  PROGRAMS AND SERVICES FOR ELs AND THEIR FAMILIES (CONTINUED)",null,null,null,null,null,null,null,null,null,null,null,null,null,null,null,"E.  PROGRAMS AND SERVICES FOR ELs AND THEIR FAMILIES (CONTINUED)",null,null,null,null,null,null,null,null,null,null,null,null,null,null,null,"E.  PROGRAMS AND SERVICES FOR ELs AND THEIR FAMILIES (CONTINUED)",null,null,null,null,null,null,null,null,null,null,null,null,null,null,null,"E.  PROGRAMS AND SERVICES FOR ELs AND THEIR FAMILIES (CONTINUED)",null,null,null,null,null,null,null,null,null,null,null,null,null,null,null,"E.  PROGRAMS AND SERVICES FOR ELs AND THEIR FAMILIES (CONTINUED)",null,null,null,null,null,null,null,null,null,null,null,null,null,null,null,"E.  PROGRAMS AND SERVICES FOR ELs AND THEIR FAMILIES (CONTINUED)",null,null,null,null,null,null,null,null,null,null,null,null,null,null,null,"E.  PROGRAMS AND SERVICES FOR ELs AND THEIR FAMILIES (CONTINUED)",null,null,null,null,null,null,null,null,null,null,null,null,null,null,null,"E.  PROGRAMS AND SERVICES FOR ELs AND THEIR FAMILIES (CONTINUED)",null,null,null,null,null,null,null,null,null,null,null,null,null,null,null,"E.  PROGRAMS AND SERVICES FOR ELs AND THEIR FAMILIES (CONTINUED)",null,null,null,null,null,null,null,null,null,null,null,null,null,null,null,"E.  PROGRAMS AND SERVICES FOR ELs AND THEIR FAMILIES (CONTINUED)",null,null,null,null,null,null,null,null,null,null,null,null,null,null,null,"E.  PROGRAMS AND SERVICES FOR ELs AND THEIR FAMILIES (CONTINUED)",null,null,null,null,null,null,null,null,null,null,null,null,null,null,null,"E.  PROGRAMS AND SERVICES FOR ELs AND THEIR FAMILIES (CONTINUED)",null,null,null,null,null,null,null,null,null,null,null,null,null,null,null,"E.  PROGRAMS AND SERVICES FOR ELs AND THEIR FAMILIES (CONTINUED)",null,null,null,null,null,null,null,null,null,null,null,null,null,null,null,"E.  PROGRAMS AND SERVICES FOR ELs AND THEIR FAMILIES (CONTINUED)",null,null,null,null,null,null,null,null,null,null,null,null,null,null,null,"E.  PROGRAMS AND SERVICES FOR ELs AND THEIR FAMILIES (CONTINUED)",null,null,null,null,null,null,null,null,null,null,null,null,null,null,null,"E.  PROGRAMS AND SERVICES FOR ELs AND THEIR FAMILIES (CONTINUED)",null,null,null,null,null,null,null,null,null,null,null,null,null,null,null,"E.  PROGRAMS AND SERVICES FOR ELs AND THEIR FAMILIES (CONTINUED)",null,null,null,null,null,null,null,null,null,null,null,null,null,null,null,"E.  PROGRAMS AND SERVICES FOR ELs AND THEIR FAMILIES (CONTINUED)",null,null,null,null,null,null,null,null,null,null,null,null,null,null,null,"E.  PROGRAMS AND SERVICES FOR ELs AND THEIR FAMILIES (CONTINUED)",null,null,null,null,null,null,null,null,null,null,null,null,null,null,null,"E.  PROGRAMS AND SERVICES FOR ELs AND THEIR FAMILIES (CONTINUED)",null,null,null,null,null,null,null,null,null,null,null,null,null,null,null,"E.  PROGRAMS AND SERVICES FOR ELs AND THEIR FAMILIES (CONTINUED)",null,null,null,null,null,null,null,null,null,null,null,null,null,null,null,"E.  PROGRAMS AND SERVICES FOR ELs AND THEIR FAMILIES (CONTINUED)",null,null,null,null,null,null,null,null,null,null,null,null,null,null,null,"E.  PROGRAMS AND SERVICES FOR ELs AND THEIR FAMILIES (CONTINUED)",null,null,null,null,null,null,null,null,null,null,null,null,null,null,null,"E.  PROGRAMS AND SERVICES FOR ELs AND THEIR FAMILIES (CONTINUED)",null,null,null,null,null,null,null,null,null,null,null,null,null,null,null,"E.  PROGRAMS AND SERVICES FOR ELs AND THEIR FAMILIES (CONTINUED)",null,null,null,null,null,null,null,null,null,null,null,null,null,null,null,"E.  PROGRAMS AND SERVICES FOR ELs AND THEIR FAMILIES (CONTINUED)",null,null,null,null,null,null,null,null,null,null,null,null,null,null,null,"E.  PROGRAMS AND SERVICES FOR ELs AND THEIR FAMILIES (CONTINUED)",null,null,null,null,null,null,null,null,null,null,null,null,null,null,null,"E.  PROGRAMS AND SERVICES FOR ELs AND THEIR FAMILIES (CONTINUED)",null,null,null,null,null,null,null,null,null,null,null,null,null,null,null,"E.  PROGRAMS AND SERVICES FOR ELs AND THEIR FAMILIES (CONTINUED)",null,null,null,null,null,null,null,null,null,null,null,null,null,null,null,"E.  PROGRAMS AND SERVICES FOR ELs AND THEIR FAMILIES (CONTINUED)",null,null,null,null,null,null,null,null,null,null,null,null,null,null,null,"E.  PROGRAMS AND SERVICES FOR ELs AND THEIR FAMILIES (CONTINUED)",null,null,null,null,null,null,null,null,null,null,null,null,null,null,null,"E.  PROGRAMS AND SERVICES FOR ELs AND THEIR FAMILIES (CONTINUED)",null,null,null,null,null,null,null,null,null,null,null,null,null,null,null,"E.  PROGRAMS AND SERVICES FOR ELs AND THEIR FAMILIES (CONTINUED)",null,null,null,null,null,null,null,null,null,null,null,null,null,null,null,"E.  PROGRAMS AND SERVICES FOR ELs AND THEIR FAMILIES (CONTINUED)",null,null,null,null,null,null,null,null,null,null,null,null,null,null,null,"E.  PROGRAMS AND SERVICES FOR ELs AND THEIR FAMILIES (CONTINUED)",null,null,null,null,null,null,null,null,null,null,null,null,null,null,null,"E.  PROGRAMS AND SERVICES FOR ELs AND THEIR FAMILIES (CONTINUED)",null,null,null,null,null,null,null,null,null,null,null,null,null,null,null,"E.  PROGRAMS AND SERVICES FOR ELs AND THEIR FAMILIES (CONTINUED)",null,null,null,null,null,null,null,null,null,null,null,null,null,null,null,"E.  PROGRAMS AND SERVICES FOR ELs AND THEIR FAMILIES (CONTINUED)",null,null,null,null,null,null,null,null,null,null,null,null,null,null,null,"E.  PROGRAMS AND SERVICES FOR ELs AND THEIR FAMILIES (CONTINUED)",null,null,null,null,null,null,null,null,null,null,null,null,null,null,null,"E.  PROGRAMS AND SERVICES FOR ELs AND THEIR FAMILIES (CONTINUED)",null,null,null,null,null,null,null,null,null,null,null,null,null,null,null,"E.  PROGRAMS AND SERVICES FOR ELs AND THEIR FAMILIES (CONTINUED)",null,null,null,null,null,null,null,null,null,null,null,null,null,null,null,"E.  PROGRAMS AND SERVICES FOR ELs AND THEIR FAMILIES (CONTINUED)",null,null,null,null,null,null,null,null,null,null,null,null,null,null,null,"E.  PROGRAMS AND SERVICES FOR ELs AND THEIR FAMILIES (CONTINUED)",null,null,null,null,null,null,null,null,null,null,null,null,null,null,null,"E.  PROGRAMS AND SERVICES FOR ELs AND THEIR FAMILIES (CONTINUED)",null,null,null,null,null,null,null,null,null,null,null,null,null,null,null,"E.  PROGRAMS AND SERVICES FOR ELs AND THEIR FAMILIES (CONTINUED)",null,null,null,null,null,null,null,null,null,null,null,null,null,null,null,"E.  PROGRAMS AND SERVICES FOR ELs AND THEIR FAMILIES (CONTINUED)",null,null,null,null,null,null,null,null,null,null,null,null,null,null,null,"E.  PROGRAMS AND SERVICES FOR ELs AND THEIR FAMILIES (CONTINUED)",null,null,null,null,null,null,null,null,null,null,null,null,null,null,null,"E.  PROGRAMS AND SERVICES FOR ELs AND THEIR FAMILIES (CONTINUED)",null,null,null,null,null,null,null,null,null,null,null,null,null,null,null,"E.  PROGRAMS AND SERVICES FOR ELs AND THEIR FAMILIES (CONTINUED)",null,null,null,null,null,null,null,null,null,null,null,null,null,null,null,"E.  PROGRAMS AND SERVICES FOR ELs AND THEIR FAMILIES (CONTINUED)",null,null,null,null,null,null,null,null,null,null,null,null,null,null,null,"E.  PROGRAMS AND SERVICES FOR ELs AND THEIR FAMILIES (CONTINUED)",null,null,null,null,null,null,null,null,null,null,null,null,null,null,null,"E.  PROGRAMS AND SERVICES FOR ELs AND THEIR FAMILIES (CONTINUED)",null,null,null,null,null,null,null,null,null,null,null,null,null,null,null,"E.  PROGRAMS AND SERVICES FOR ELs AND THEIR FAMILIES (CONTINUED)",null,null,null,null,null,null,null,null,null,null,null,null,null,null,null,"E.  PROGRAMS AND SERVICES FOR ELs AND THEIR FAMILIES (CONTINUED)",null,null,null,null,null,null,null,null,null,null,null,null,null,null,null,"E.  PROGRAMS AND SERVICES FOR ELs AND THEIR FAMILIES (CONTINUED)",null,null,null,null,null,null,null,null,null,null,null,null,null,null,null,"E.  PROGRAMS AND SERVICES FOR ELs AND THEIR FAMILIES (CONTINUED)",null,null,null,null,null,null,null,null,null,null,null,null,null,null,null,"E.  PROGRAMS AND SERVICES FOR ELs AND THEIR FAMILIES (CONTINUED)",null,null,null,null,null,null,null,null,null,null,null,null,null,null,null,"E.  PROGRAMS AND SERVICES FOR ELs AND THEIR FAMILIES (CONTINUED)",null,null,null,null,null,null,null,null,null,null,null,null,null,null,null,"E.  PROGRAMS AND SERVICES FOR ELs AND THEIR FAMILIES (CONTINUED)",null,null,null,null,null,null,null,null,null,null,null,null,null,null,null,"E.  PROGRAMS AND SERVICES FOR ELs AND THEIR FAMILIES (CONTINUED)",null,null,null,null,null,null,null,null,null,null,null,null,null,null,null,"E.  PROGRAMS AND SERVICES FOR ELs AND THEIR FAMILIES (CONTINUED)",null,null,null,null,null,null,null,null,null,null,null,null,null,null,null,"E.  PROGRAMS AND SERVICES FOR ELs AND THEIR FAMILIES (CONTINUED)",null,null,null,null,null,null,null,null,null,null,null,null,null,null,null,"E.  PROGRAMS AND SERVICES FOR ELs AND THEIR FAMILIES (CONTINUED)",null,null,null,null,null,null,null,null,null,null,null,null,null,null,null,"E.  PROGRAMS AND SERVICES FOR ELs AND THEIR FAMILIES (CONTINUED)",null,null,null,null,null,null,null,null,null,null,null,null,null,null,null,"E.  PROGRAMS AND SERVICES FOR ELs AND THEIR FAMILIES (CONTINUED)",null,null,null,null,null,null,null,null,null,null,null,null,null,null,null,"E.  PROGRAMS AND SERVICES FOR ELs AND THEIR FAMILIES (CONTINUED)",null,null,null,null,null,null,null,null,null,null,null,null,null,null,null,"E.  PROGRAMS AND SERVICES FOR ELs AND THEIR FAMILIES (CONTINUED)",null,null,null,null,null,null,null,null,null,null,null,null,null,null,null,"E.  PROGRAMS AND SERVICES FOR ELs AND THEIR FAMILIES (CONTINUED)",null,null,null,null,null,null,null,null,null,null,null,null,null,null,null,"E.  PROGRAMS AND SERVICES FOR ELs AND THEIR FAMILIES (CONTINUED)",null,null,null,null,null,null,null,null,null,null,null,null,null,null,null,"E.  PROGRAMS AND SERVICES FOR ELs AND THEIR FAMILIES (CONTINUED)",null,null,null,null,null,null,null,null,null,null,null,null,null,null,null,"E.  PROGRAMS AND SERVICES FOR ELs AND THEIR FAMILIES (CONTINUED)",null,null,null,null,null,null,null,null,null,null,null,null,null,null,null,"E.  PROGRAMS AND SERVICES FOR ELs AND THEIR FAMILIES (CONTINUED)",null,null,null,null,null,null,null,null,null,null,null,null,null,null,null,"E.  PROGRAMS AND SERVICES FOR ELs AND THEIR FAMILIES (CONTINUED)",null,null,null,null,null,null,null,null,null,null,null,null,null,null,null,"E.  PROGRAMS AND SERVICES FOR ELs AND THEIR FAMILIES (CONTINUED)",null,null,null,null,null,null,null,null,null,null,null,null,null,null,null,"E.  PROGRAMS AND SERVICES FOR ELs AND THEIR FAMILIES (CONTINUED)",null,null,null,null,null,null,null,null,null,null,null,null,null,null,null,"E.  PROGRAMS AND SERVICES FOR ELs AND THEIR FAMILIES (CONTINUED)",null,null,null,null,null,null,null,null,null,null,null,null,null,null,null,"E.  PROGRAMS AND SERVICES FOR ELs AND THEIR FAMILIES (CONTINUED)",null,null,null,null,null,null,null,null,null,null,null,null,null,null,null,"E.  PROGRAMS AND SERVICES FOR ELs AND THEIR FAMILIES (CONTINUED)",null,null,null,null,null,null,null,null,null,null,null,null,null,null,null,"E.  PROGRAMS AND SERVICES FOR ELs AND THEIR FAMILIES (CONTINUED)",null,null,null,null,null,null,null,null,null,null,null,null,null,null,null,"E.  PROGRAMS AND SERVICES FOR ELs AND THEIR FAMILIES (CONTINUED)",null,null,null,null,null,null,null,null,null,null,null,null,null,null,null,"E.  PROGRAMS AND SERVICES FOR ELs AND THEIR FAMILIES (CONTINUED)",null,null,null,null,null,null,null,null,null,null,null,null,null,null,null,"E.  PROGRAMS AND SERVICES FOR ELs AND THEIR FAMILIES (CONTINUED)",null,null,null,null,null,null,null,null,null,null,null,null,null,null,null,"E.  PROGRAMS AND SERVICES FOR ELs AND THEIR FAMILIES (CONTINUED)",null,null,null,null,null,null,null,null,null,null,null,null,null,null,null,"E.  PROGRAMS AND SERVICES FOR ELs AND THEIR FAMILIES (CONTINUED)",null,null,null,null,null,null,null,null,null,null,null,null,null,null,null,"E.  PROGRAMS AND SERVICES FOR ELs AND THEIR FAMILIES (CONTINUED)",null,null,null,null,null,null,null,null,null,null,null,null,null,null,null,"E.  PROGRAMS AND SERVICES FOR ELs AND THEIR FAMILIES (CONTINUED)",null,null,null,null,null,null,null,null,null,null,null,null,null,null,null,"E.  PROGRAMS AND SERVICES FOR ELs AND THEIR FAMILIES (CONTINUED)",null,null,null,null,null,null,null,null,null,null,null,null,null,null,null,"E.  PROGRAMS AND SERVICES FOR ELs AND THEIR FAMILIES (CONTINUED)",null,null,null,null,null,null,null,null,null,null,null,null,null,null,null,"E.  PROGRAMS AND SERVICES FOR ELs AND THEIR FAMILIES (CONTINUED)",null,null,null,null,null,null,null,null,null,null,null,null,null,null,null,"E.  PROGRAMS AND SERVICES FOR ELs AND THEIR FAMILIES (CONTINUED)",null,null,null,null,null,null,null,null,null,null,null,null,null,null,null,"E.  PROGRAMS AND SERVICES FOR ELs AND THEIR FAMILIES (CONTINUED)",null,null,null,null,null,null,null,null,null,null,null,null,null,null,null,"E.  PROGRAMS AND SERVICES FOR ELs AND THEIR FAMILIES (CONTINUED)",null,null,null,null,null,null,null,null,null,null,null,null,null,null,null,"E.  PROGRAMS AND SERVICES FOR ELs AND THEIR FAMILIES (CONTINUED)",null,null,null,null,null,null,null,null,null,null,null,null,null,null,null,"E.  PROGRAMS AND SERVICES FOR ELs AND THEIR FAMILIES (CONTINUED)",null,null,null,null,null,null,null,null,null,null,null,null,null,null,null,"E.  PROGRAMS AND SERVICES FOR ELs AND THEIR FAMILIES (CONTINUED)",null,null,null,null,null,null,null,null,null,null,null,null,null,null,null,"E.  PROGRAMS AND SERVICES FOR ELs AND THEIR FAMILIES (CONTINUED)",null,null,null,null,null,null,null,null,null,null,null,null,null,null,null,"E.  PROGRAMS AND SERVICES FOR ELs AND THEIR FAMILIES (CONTINUED)",null,null,null,null,null,null,null,null,null,null,null,null,null,null,null,"E.  PROGRAMS AND SERVICES FOR ELs AND THEIR FAMILIES (CONTINUED)",null,null,null,null,null,null,null,null,null,null,null,null,null,null,null,"E.  PROGRAMS AND SERVICES FOR ELs AND THEIR FAMILIES (CONTINUED)",null,null,null,null,null,null,null,null,null,null,null,null,null,null,null,"E.  PROGRAMS AND SERVICES FOR ELs AND THEIR FAMILIES (CONTINUED)",null,null,null,null,null,null,null,null,null,null,null,null,null,null,null,"E.  PROGRAMS AND SERVICES FOR ELs AND THEIR FAMILIES (CONTINUED)",null,null,null,null,null,null,null,null,null,null,null,null,null,null,null,"E.  PROGRAMS AND SERVICES FOR ELs AND THEIR FAMILIES (CONTINUED)",null,null,null,null,null,null,null,null,null,null,null,null,null,null,null,"E.  PROGRAMS AND SERVICES FOR ELs AND THEIR FAMILIES (CONTINUED)",null,null,null,null,null,null,null,null,null,null,null,null,null,null,null,"E.  PROGRAMS AND SERVICES FOR ELs AND THEIR FAMILIES (CONTINUED)",null,null,null,null,null,null,null,null,null,null,null,null,null,null,null,"E.  PROGRAMS AND SERVICES FOR ELs AND THEIR FAMILIES (CONTINUED)",null,null,null,null,null,null,null,null,null,null,null,null,null,null,null,"E.  PROGRAMS AND SERVICES FOR ELs AND THEIR FAMILIES (CONTINUED)",null,null,null,null,null,null,null,null,null,null,null,null,null,null,null,"E.  PROGRAMS AND SERVICES FOR ELs AND THEIR FAMILIES (CONTINUED)",null,null,null,null,null,null,null,null,null,null,null,null,null,null,null,"E.  PROGRAMS AND SERVICES FOR ELs AND THEIR FAMILIES (CONTINUED)",null,null,null,null,null,null,null,null,null,null,null,null,null,null,null,"E.  PROGRAMS AND SERVICES FOR ELs AND THEIR FAMILIES (CONTINUED)",null,null,null,null,null,null,null,null,null,null,null,null,null,null,null,"E.  PROGRAMS AND SERVICES FOR ELs AND THEIR FAMILIES (CONTINUED)",null,null,null,null,null,null,null,null,null,null,null,null,null,null,null,"E.  PROGRAMS AND SERVICES FOR ELs AND THEIR FAMILIES (CONTINUED)",null,null,null,null,null,null,null,null,null,null,null,null,null,null,null,"E.  PROGRAMS AND SERVICES FOR ELs AND THEIR FAMILIES (CONTINUED)",null,null,null,null,null,null,null,null,null,null,null,null,null,null,null,"E.  PROGRAMS AND SERVICES FOR ELs AND THEIR FAMILIES (CONTINUED)",null,null,null,null,null,null,null,null,null,null,null,null,null,null,null,"E.  PROGRAMS AND SERVICES FOR ELs AND THEIR FAMILIES (CONTINUED)",null,null,null,null,null,null,null,null,null,null,null,null,null,null,null,"E.  PROGRAMS AND SERVICES FOR ELs AND THEIR FAMILIES (CONTINUED)",null,null,null,null,null,null,null,null,null,null,null,null,null,null,null,"E.  PROGRAMS AND SERVICES FOR ELs AND THEIR FAMILIES (CONTINUED)",null,null,null,null,null,null,null,null,null,null,null,null,null,null,null,"E.  PROGRAMS AND SERVICES FOR ELs AND THEIR FAMILIES (CONTINUED)",null,null,null,null,null,null,null,null,null,null,null,null,null,null,null,"E.  PROGRAMS AND SERVICES FOR ELs AND THEIR FAMILIES (CONTINUED)",null,null,null,null,null,null,null,null,null,null,null,null,null,null,null,"E.  PROGRAMS AND SERVICES FOR ELs AND THEIR FAMILIES (CONTINUED)",null,null,null,null,null,null,null,null,null,null,null,null,null,null,null,"E.  PROGRAMS AND SERVICES FOR ELs AND THEIR FAMILIES (CONTINUED)",null,null,null,null,null,null,null,null,null,null,null,null,null,null,null,"E.  PROGRAMS AND SERVICES FOR ELs AND THEIR FAMILIES (CONTINUED)",null,null,null,null,null,null,null,null,null,null,null,null,null,null,null,"E.  PROGRAMS AND SERVICES FOR ELs AND THEIR FAMILIES (CONTINUED)",null,null,null,null,null,null,null,null,null,null,null,null,null,null,null,"E.  PROGRAMS AND SERVICES FOR ELs AND THEIR FAMILIES (CONTINUED)",null,null,null,null,null,null,null,null,null,null,null,null,null,null,null,"E.  PROGRAMS AND SERVICES FOR ELs AND THEIR FAMILIES (CONTINUED)",null,null,null,null,null,null,null,null,null,null,null,null,null,null,null,"E.  PROGRAMS AND SERVICES FOR ELs AND THEIR FAMILIES (CONTINUED)",null,null,null,null,null,null,null,null,null,null,null,null,null,null,null,"E.  PROGRAMS AND SERVICES FOR ELs AND THEIR FAMILIES (CONTINUED)",null,null,null,null,null,null,null,null,null,null,null,null,null,null,null,"E.  PROGRAMS AND SERVICES FOR ELs AND THEIR FAMILIES (CONTINUED)",null,null,null,null,null,null,null,null,null,null,null,null,null,null,null,"E.  PROGRAMS AND SERVICES FOR ELs AND THEIR FAMILIES (CONTINUED)",null,null,null,null,null,null,null,null,null,null,null,null,null,null,null,"E.  PROGRAMS AND SERVICES FOR ELs AND THEIR FAMILIES (CONTINUED)",null,null,null,null,null,null,null,null,null,null,null,null,null,null,null,"E.  PROGRAMS AND SERVICES FOR ELs AND THEIR FAMILIES (CONTINUED)",null,null,null,null,null,null,null,null,null,null,null,null,null,null,null,"E.  PROGRAMS AND SERVICES FOR ELs AND THEIR FAMILIES (CONTINUED)",null,null,null,null,null,null,null,null,null,null,null,null,null,null,null,"E.  PROGRAMS AND SERVICES FOR ELs AND THEIR FAMILIES (CONTINUED)",null,null,null,null,null,null,null,null,null,null,null,null,null,null,null,"E.  PROGRAMS AND SERVICES FOR ELs AND THEIR FAMILIES (CONTINUED)",null,null,null,null,null,null,null,null,null,null,null,null,null,null,null,"E.  PROGRAMS AND SERVICES FOR ELs AND THEIR FAMILIES (CONTINUED)",null,null,null,null,null,null,null,null,null,null,null,null,null,null,null,"E.  PROGRAMS AND SERVICES FOR ELs AND THEIR FAMILIES (CONTINUED)",null,null,null,null,null,null,null,null,null,null,null,null,null,null,null,"E.  PROGRAMS AND SERVICES FOR ELs AND THEIR FAMILIES (CONTINUED)",null,null,null,null,null,null,null,null,null,null,null,null,null,null,null,"E.  PROGRAMS AND SERVICES FOR ELs AND THEIR FAMILIES (CONTINUED)",null,null,null,null,null,null,null,null,null,null,null,null,null,null,null,"E.  PROGRAMS AND SERVICES FOR ELs AND THEIR FAMILIES (CONTINUED)",null,null,null,null,null,null,null,null,null,null,null,null,null,null,null,"E.  PROGRAMS AND SERVICES FOR ELs AND THEIR FAMILIES (CONTINUED)",null,null,null,null,null,null,null,null,null,null,null,null,null,null,null,"E.  PROGRAMS AND SERVICES FOR ELs AND THEIR FAMILIES (CONTINUED)",null,null,null,null,null,null,null,null,null,null,null,null,null,null,null,"E.  PROGRAMS AND SERVICES FOR ELs AND THEIR FAMILIES (CONTINUED)",null,null,null,null,null,null,null,null,null,null,null,null,null,null,null,"E.  PROGRAMS AND SERVICES FOR ELs AND THEIR FAMILIES (CONTINUED)",null,null,null,null,null,null,null,null,null,null,null,null,null,null,null,"E.  PROGRAMS AND SERVICES FOR ELs AND THEIR FAMILIES (CONTINUED)",null,null,null,null,null,null,null,null,null,null,null,null,null,null,null,"E.  PROGRAMS AND SERVICES FOR ELs AND THEIR FAMILIES (CONTINUED)",null,null,null,null,null,null,null,null,null,null,null,null,null,null,null,"E.  PROGRAMS AND SERVICES FOR ELs AND THEIR FAMILIES (CONTINUED)",null,null,null,null,null,null,null,null,null,null,null,null,null,null,null,"E.  PROGRAMS AND SERVICES FOR ELs AND THEIR FAMILIES (CONTINUED)",null,null,null,null,null,null,null,null,null,null,null,null,null,null,null,"E.  PROGRAMS AND SERVICES FOR ELs AND THEIR FAMILIES (CONTINUED)",null,null,null,null,null,null,null,null,null,null,null,null,null,null,null,"E.  PROGRAMS AND SERVICES FOR ELs AND THEIR FAMILIES (CONTINUED)",null,null,null,null,null,null,null,null,null,null,null,null,null,null,null,"E.  PROGRAMS AND SERVICES FOR ELs AND THEIR FAMILIES (CONTINUED)",null,null,null,null,null,null,null,null,null,null,null,null,null,null,null,"E.  PROGRAMS AND SERVICES FOR ELs AND THEIR FAMILIES (CONTINUED)",null,null,null,null,null,null,null,null,null,null,null,null,null,null,null,"E.  PROGRAMS AND SERVICES FOR ELs AND THEIR FAMILIES (CONTINUED)",null,null,null,null,null,null,null,null,null,null,null,null,null,null,null,"E.  PROGRAMS AND SERVICES FOR ELs AND THEIR FAMILIES (CONTINUED)",null,null,null,null,null,null,null,null,null,null,null,null,null,null,null,"E.  PROGRAMS AND SERVICES FOR ELs AND THEIR FAMILIES (CONTINUED)",null,null,null,null,null,null,null,null,null,null,null,null,null,null,null,"E.  PROGRAMS AND SERVICES FOR ELs AND THEIR FAMILIES (CONTINUED)",null,null,null,null,null,null,null,null,null,null,null,null,null,null,null,"E.  PROGRAMS AND SERVICES FOR ELs AND THEIR FAMILIES (CONTINUED)",null,null,null,null,null,null,null,null,null,null,null,null,null,null,null,"E.  PROGRAMS AND SERVICES FOR ELs AND THEIR FAMILIES (CONTINUED)",null,null,null,null,null,null,null,null,null,null,null,null,null,null,null,"E.  PROGRAMS AND SERVICES FOR ELs AND THEIR FAMILIES (CONTINUED)",null,null,null,null,null,null,null,null,null,null,null,null,null,null,null,"E.  PROGRAMS AND SERVICES FOR ELs AND THEIR FAMILIES (CONTINUED)",null,null,null,null,null,null,null,null,null,null,null,null,null,null,null,"E.  PROGRAMS AND SERVICES FOR ELs AND THEIR FAMILIES (CONTINUED)",null,null,null,null,null,null,null,null,null,null,null,null,null,null,null,"E.  PROGRAMS AND SERVICES FOR ELs AND THEIR FAMILIES (CONTINUED)",null,null,null,null,null,null,null,null,null,null,null,null,null,null,null,"E.  PROGRAMS AND SERVICES FOR ELs AND THEIR FAMILIES (CONTINUED)",null,null,null,null,null,null,null,null,null,null,null,null,null,null,null,"E.  PROGRAMS AND SERVICES FOR ELs AND THEIR FAMILIES (CONTINUED)",null,null,null,null,null,null,null,null,null,null,null,null,null,null,null,"E.  PROGRAMS AND SERVICES FOR ELs AND THEIR FAMILIES (CONTINUED)",null,null,null,null,null,null,null,null,null,null,null,null,null,null,null,"E.  PROGRAMS AND SERVICES FOR ELs AND THEIR FAMILIES (CONTINUED)",null,null,null,null,null,null,null,null,null,null,null,null,null,null,null,"E.  PROGRAMS AND SERVICES FOR ELs AND THEIR FAMILIES (CONTINUED)",null,null,null,null,null,null,null,null,null,null,null,null,null,null,null,"E.  PROGRAMS AND SERVICES FOR ELs AND THEIR FAMILIES (CONTINUED)",null,null,null,null,null,null,null,null,null,null,null,null,null,null,null,"E.  PROGRAMS AND SERVICES FOR ELs AND THEIR FAMILIES (CONTINUED)",null,null,null,null,null,null,null,null,null,null,null,null,null,null,null,"E.  PROGRAMS AND SERVICES FOR ELs AND THEIR FAMILIES (CONTINUED)",null,null,null,null,null,null,null,null,null,null,null,null,null,null,null,"E.  PROGRAMS AND SERVICES FOR ELs AND THEIR FAMILIES (CONTINUED)",null,null,null,null,null,null,null,null,null,null,null,null,null,null,null,"E.  PROGRAMS AND SERVICES FOR ELs AND THEIR FAMILIES (CONTINUED)",null,null,null,null,null,null,null,null,null,null,null,null,null,null,null,"E.  PROGRAMS AND SERVICES FOR ELs AND THEIR FAMILIES (CONTINUED)",null,null,null,null,null,null,null,null,null,null,null,null,null,null,null,"E.  PROGRAMS AND SERVICES FOR ELs AND THEIR FAMILIES (CONTINUED)",null,null,null,null,null,null,null,null,null,null,null,null,null,null,null,"E.  PROGRAMS AND SERVICES FOR ELs AND THEIR FAMILIES (CONTINUED)",null,null,null,null,null,null,null,null,null,null,null,null,null,null,null,"E.  PROGRAMS AND SERVICES FOR ELs AND THEIR FAMILIES (CONTINUED)",null,null,null,null,null,null,null,null,null,null,null,null,null,null,null,"E.  PROGRAMS AND SERVICES FOR ELs AND THEIR FAMILIES (CONTINUED)",null,null,null,null,null,null,null,null,null,null,null,null,null,null,null,"E.  PROGRAMS AND SERVICES FOR ELs AND THEIR FAMILIES (CONTINUED)",null,null,null,null,null,null,null,null,null,null,null,null,null,null,null,"E.  PROGRAMS AND SERVICES FOR ELs AND THEIR FAMILIES (CONTINUED)",null,null,null,null,null,null,null,null,null,null,null,null,null,null,null,"E.  PROGRAMS AND SERVICES FOR ELs AND THEIR FAMILIES (CONTINUED)",null,null,null,null,null,null,null,null,null,null,null,null,null,null,null,"E.  PROGRAMS AND SERVICES FOR ELs AND THEIR FAMILIES (CONTINUED)",null,null,null,null,null,null,null,null,null,null,null,null,null,null,null,"E.  PROGRAMS AND SERVICES FOR ELs AND THEIR FAMILIES (CONTINUED)",null,null,null,null,null,null,null,null,null,null,null,null,null,null,null,"E.  PROGRAMS AND SERVICES FOR ELs AND THEIR FAMILIES (CONTINUED)",null,null,null,null,null,null,null,null,null,null,null,null,null,null,null,"E.  PROGRAMS AND SERVICES FOR ELs AND THEIR FAMILIES (CONTINUED)",null,null,null,null,null,null,null,null,null,null,null,null,null,null,null,"E.  PROGRAMS AND SERVICES FOR ELs AND THEIR FAMILIES (CONTINUED)",null,null,null,null,null,null,null,null,null,null,null,null,null,null,null,"E.  PROGRAMS AND SERVICES FOR ELs AND THEIR FAMILIES (CONTINUED)",null,null,null,null,null,null,null,null,null,null,null,null,null,null,null,"E.  PROGRAMS AND SERVICES FOR ELs AND THEIR FAMILIES (CONTINUED)",null,null,null,null,null,null,null,null,null,null,null,null,null,null,null,"E.  PROGRAMS AND SERVICES FOR ELs AND THEIR FAMILIES (CONTINUED)",null,null,null,null,null,null,null,null,null,null,null,null,null,null,null,"E.  PROGRAMS AND SERVICES FOR ELs AND THEIR FAMILIES (CONTINUED)",null,null,null,null,null,null,null,null,null,null,null,null,null,null,null,"E.  PROGRAMS AND SERVICES FOR ELs AND THEIR FAMILIES (CONTINUED)",null,null,null,null,null,null,null,null,null,null,null,null,null,null,null,"E.  PROGRAMS AND SERVICES FOR ELs AND THEIR FAMILIES (CONTINUED)",null,null,null,null,null,null,null,null,null,null,null,null,null,null,null,"E.  PROGRAMS AND SERVICES FOR ELs AND THEIR FAMILIES (CONTINUED)",null,null,null,null,null,null,null,null,null,null,null,null,null,null,null,"E.  PROGRAMS AND SERVICES FOR ELs AND THEIR FAMILIES (CONTINUED)",null,null,null,null,null,null,null,null,null,null,null,null,null,null,null,"E.  PROGRAMS AND SERVICES FOR ELs AND THEIR FAMILIES (CONTINUED)",null,null,null,null,null,null,null,null,null,null,null,null,null,null,null,"E.  PROGRAMS AND SERVICES FOR ELs AND THEIR FAMILIES (CONTINUED)",null,null,null,null,null,null,null,null,null,null,null,null,null,null,null,"E.  PROGRAMS AND SERVICES FOR ELs AND THEIR FAMILIES (CONTINUED)",null,null,null,null,null,null,null,null,null,null,null,null,null,null,null,"E.  PROGRAMS AND SERVICES FOR ELs AND THEIR FAMILIES (CONTINUED)",null,null,null,null,null,null,null,null,null,null,null,null,null,null,null,"E.  PROGRAMS AND SERVICES FOR ELs AND THEIR FAMILIES (CONTINUED)",null,null,null,null,null,null,null,null,null,null,null,null,null,null,null,"E.  PROGRAMS AND SERVICES FOR ELs AND THEIR FAMILIES (CONTINUED)",null,null,null,null,null,null,null,null,null,null,null,null,null,null,null,"E.  PROGRAMS AND SERVICES FOR ELs AND THEIR FAMILIES (CONTINUED)",null,null,null,null,null,null,null,null,null,null,null,null,null,null,null,"E.  PROGRAMS AND SERVICES FOR ELs AND THEIR FAMILIES (CONTINUED)",null,null,null,null,null,null,null,null,null,null,null,null,null,null,null,"E.  PROGRAMS AND SERVICES FOR ELs AND THEIR FAMILIES (CONTINUED)",null,null,null,null,null,null,null,null,null,null,null,null,null,null,null,"E.  PROGRAMS AND SERVICES FOR ELs AND THEIR FAMILIES (CONTINUED)",null,null,null,null,null,null,null,null,null,null,null,null,null,null,null,"E.  PROGRAMS AND SERVICES FOR ELs AND THEIR FAMILIES (CONTINUED)",null,null,null,null,null,null,null,null,null,null,null,null,null,null,null,"E.  PROGRAMS AND SERVICES FOR ELs AND THEIR FAMILIES (CONTINUED)",null,null,null,null,null,null,null,null,null,null,null,null,null,null,null,"E.  PROGRAMS AND SERVICES FOR ELs AND THEIR FAMILIES (CONTINUED)",null,null,null,null,null,null,null,null,null,null,null,null,null,null,null,"E.  PROGRAMS AND SERVICES FOR ELs AND THEIR FAMILIES (CONTINUED)",null,null,null,null,null,null,null,null,null,null,null,null,null,null,null,"E.  PROGRAMS AND SERVICES FOR ELs AND THEIR FAMILIES (CONTINUED)",null,null,null,null,null,null,null,null,null,null,null,null,null,null,null,"E.  PROGRAMS AND SERVICES FOR ELs AND THEIR FAMILIES (CONTINUED)",null,null,null,null,null,null,null,null,null,null,null,null,null,null,null,"E.  PROGRAMS AND SERVICES FOR ELs AND THEIR FAMILIES (CONTINUED)",null,null,null,null,null,null,null,null,null,null,null,null,null,null,null,"E.  PROGRAMS AND SERVICES FOR ELs AND THEIR FAMILIES (CONTINUED)",null,null,null,null,null,null,null,null,null,null,null,null,null,null,null,"E.  PROGRAMS AND SERVICES FOR ELs AND THEIR FAMILIES (CONTINUED)",null,null,null,null,null,null,null,null,null,null,null,null,null,null,null,"E.  PROGRAMS AND SERVICES FOR ELs AND THEIR FAMILIES (CONTINUED)",null,null,null,null,null,null,null,null,null,null,null,null,null,null,null,"E.  PROGRAMS AND SERVICES FOR ELs AND THEIR FAMILIES (CONTINUED)",null,null,null,null,null,null,null,null,null,null,null,null,null,null,null,"E.  PROGRAMS AND SERVICES FOR ELs AND THEIR FAMILIES (CONTINUED)",null,null,null,null,null,null,null,null,null,null,null,null,null,null,null,"E.  PROGRAMS AND SERVICES FOR ELs AND THEIR FAMILIES (CONTINUED)",null,null,null,null,null,null,null,null,null,null,null,null,null,null,null,"E.  PROGRAMS AND SERVICES FOR ELs AND THEIR FAMILIES (CONTINUED)",null,null,null,null,null,null,null,null,null,null,null,null,null,null,null,"E.  PROGRAMS AND SERVICES FOR ELs AND THEIR FAMILIES (CONTINUED)",null,null,null,null,null,null,null,null,null,null,null,null,null,null,null,"E.  PROGRAMS AND SERVICES FOR ELs AND THEIR FAMILIES (CONTINUED)",null,null,null,null,null,null,null,null,null,null,null,null,null,null,null,"E.  PROGRAMS AND SERVICES FOR ELs AND THEIR FAMILIES (CONTINUED)",null,null,null,null,null,null,null,null,null,null,null,null,null,null,null,"E.  PROGRAMS AND SERVICES FOR ELs AND THEIR FAMILIES (CONTINUED)",null,null,null,null,null,null,null,null,null,null,null,null,null,null,null,"E.  PROGRAMS AND SERVICES FOR ELs AND THEIR FAMILIES (CONTINUED)",null,null,null,null,null,null,null,null,null,null,null,null,null,null,null,"E.  PROGRAMS AND SERVICES FOR ELs AND THEIR FAMILIES (CONTINUED)",null,null,null,null,null,null,null,null,null,null,null,null,null,null,null,"E.  PROGRAMS AND SERVICES FOR ELs AND THEIR FAMILIES (CONTINUED)",null,null,null,null,null,null,null,null,null,null,null,null,null,null,null,"E.  PROGRAMS AND SERVICES FOR ELs AND THEIR FAMILIES (CONTINUED)",null,null,null,null,null,null,null,null,null,null,null,null,null,null,null,"E.  PROGRAMS AND SERVICES FOR ELs AND THEIR FAMILIES (CONTINUED)",null,null,null,null,null,null,null,null,null,null,null,null,null,null,null,"E.  PROGRAMS AND SERVICES FOR ELs AND THEIR FAMILIES (CONTINUED)",null,null,null,null,null,null,null,null,null,null,null,null,null,null,null,"E.  PROGRAMS AND SERVICES FOR ELs AND THEIR FAMILIES (CONTINUED)",null,null,null,null,null,null,null,null,null,null,null,null,null,null,null,"E.  PROGRAMS AND SERVICES FOR ELs AND THEIR FAMILIES (CONTINUED)",null,null,null,null,null,null,null,null,null,null,null,null,null,null,null,"E.  PROGRAMS AND SERVICES FOR ELs AND THEIR FAMILIES (CONTINUED)",null,null,null,null,null,null,null,null,null,null,null,null,null,null,null,"E.  PROGRAMS AND SERVICES FOR ELs AND THEIR FAMILIES (CONTINUED)",null,null,null,null,null,null,null,null,null,null,null,null,null,null,null,"E.  PROGRAMS AND SERVICES FOR ELs AND THEIR FAMILIES (CONTINUED)",null,null,null,null,null,null,null,null,null,null,null,null,null,null,null,"E.  PROGRAMS AND SERVICES FOR ELs AND THEIR FAMILIES (CONTINUED)",null,null,null,null,null,null,null,null,null,null,null,null,null,null,null,"E.  PROGRAMS AND SERVICES FOR ELs AND THEIR FAMILIES (CONTINUED)",null,null,null,null,null,null,null,null,null,null,null,null,null,null,null,"E.  PROGRAMS AND SERVICES FOR ELs AND THEIR FAMILIES (CONTINUED)",null,null,null,null,null,null,null,null,null,null,null,null,null,null,null,"E.  PROGRAMS AND SERVICES FOR ELs AND THEIR FAMILIES (CONTINUED)",null,null,null,null,null,null,null,null,null,null,null,null,null,null,null,"E.  PROGRAMS AND SERVICES FOR ELs AND THEIR FAMILIES (CONTINUED)",null,null,null,null,null,null,null,null,null,null,null,null,null,null,null,"E.  PROGRAMS AND SERVICES FOR ELs AND THEIR FAMILIES (CONTINUED)",null,null,null,null,null,null,null,null,null,null,null,null,null,null,null,"E.  PROGRAMS AND SERVICES FOR ELs AND THEIR FAMILIES (CONTINUED)",null,null,null,null,null,null,null,null,null,null,null,null,null,null,null,"E.  PROGRAMS AND SERVICES FOR ELs AND THEIR FAMILIES (CONTINUED)",null,null,null,null,null,null,null,null,null,null,null,null,null,null,null,"E.  PROGRAMS AND SERVICES FOR ELs AND THEIR FAMILIES (CONTINUED)",null,null,null,null,null,null,null,null,null,null,null,null,null,null,null,"E.  PROGRAMS AND SERVICES FOR ELs AND THEIR FAMILIES (CONTINUED)",null,null,null,null,null,null,null,null,null,null,null,null,null,null,null,"E.  PROGRAMS AND SERVICES FOR ELs AND THEIR FAMILIES (CONTINUED)",null,null,null,null,null,null,null,null,null,null,null,null,null,null,null,"E.  PROGRAMS AND SERVICES FOR ELs AND THEIR FAMILIES (CONTINUED)",null,null,null,null,null,null,null,null,null,null,null,null,null,null,null,"E.  PROGRAMS AND SERVICES FOR ELs AND THEIR FAMILIES (CONTINUED)",null,null,null,null,null,null,null,null,null,null,null,null,null,null,null,"E.  PROGRAMS AND SERVICES FOR ELs AND THEIR FAMILIES (CONTINUED)",null,null,null,null,null,null,null,null,null,null,null,null,null,null,null,"E.  PROGRAMS AND SERVICES FOR ELs AND THEIR FAMILIES (CONTINUED)",null,null,null,null,null,null,null,null,null,null,null,null,null,null,null,"E.  PROGRAMS AND SERVICES FOR ELs AND THEIR FAMILIES (CONTINUED)",null,null,null,null,null,null,null,null,null,null,null,null,null,null,null,"E.  PROGRAMS AND SERVICES FOR ELs AND THEIR FAMILIES (CONTINUED)",null,null,null,null,null,null,null,null,null,null,null,null,null,null,null,"E.  PROGRAMS AND SERVICES FOR ELs AND THEIR FAMILIES (CONTINUED)",null,null,null,null,null,null,null,null,null,null,null,null,null,null,null,"E.  PROGRAMS AND SERVICES FOR ELs AND THEIR FAMILIES (CONTINUED)",null,null,null,null,null,null,null,null,null,null,null,null,null,null,null,"E.  PROGRAMS AND SERVICES FOR ELs AND THEIR FAMILIES (CONTINUED)",null,null,null,null,null,null,null,null,null,null,null,null,null,null,null,"E.  PROGRAMS AND SERVICES FOR ELs AND THEIR FAMILIES (CONTINUED)",null,null,null,null,null,null,null,null,null,null,null,null,null,null,null,"E.  PROGRAMS AND SERVICES FOR ELs AND THEIR FAMILIES (CONTINUED)",null,null,null,null,null,null,null,null,null,null,null,null,null,null,null,"E.  PROGRAMS AND SERVICES FOR ELs AND THEIR FAMILIES (CONTINUED)",null,null,null,null,null,null,null,null,null,null,null,null,null,null,null,"E.  PROGRAMS AND SERVICES FOR ELs AND THEIR FAMILIES (CONTINUED)",null,null,null,null,null,null,null,null,null,null,null,null,null,null,null,"E.  PROGRAMS AND SERVICES FOR ELs AND THEIR FAMILIES (CONTINUED)",null,null,null,null,null,null,null,null,null,null,null,null,null,null,null,"E.  PROGRAMS AND SERVICES FOR ELs AND THEIR FAMILIES (CONTINUED)",null,null,null,null,null,null,null,null,null,null,null,null,null,null,null,"E.  PROGRAMS AND SERVICES FOR ELs AND THEIR FAMILIES (CONTINUED)",null,null,null,null,null,null,null,null,null,null,null,null,null,null,null,"E.  PROGRAMS AND SERVICES FOR ELs AND THEIR FAMILIES (CONTINUED)",null,null,null,null,null,null,null,null,null,null,null,null,null,null,null,"E.  PROGRAMS AND SERVICES FOR ELs AND THEIR FAMILIES (CONTINUED)",null,null,null,null,null,null,null,null,null,null,null,null,null,null,null,"E.  PROGRAMS AND SERVICES FOR ELs AND THEIR FAMILIES (CONTINUED)",null,null,null,null,null,null,null,null,null,null,null,null,null,null,null,"E.  PROGRAMS AND SERVICES FOR ELs AND THEIR FAMILIES (CONTINUED)",null,null,null,null,null,null,null,null,null,null,null,null,null,null,null,"E.  PROGRAMS AND SERVICES FOR ELs AND THEIR FAMILIES (CONTINUED)",null,null,null,null,null,null,null,null,null,null,null,null,null,null,null,"E.  PROGRAMS AND SERVICES FOR ELs AND THEIR FAMILIES (CONTINUED)",null,null,null,null,null,null,null,null,null,null,null,null,null,null,null,"E.  PROGRAMS AND SERVICES FOR ELs AND THEIR FAMILIES (CONTINUED)",null,null,null,null,null,null,null,null,null,null,null,null,null,null,null,"E.  PROGRAMS AND SERVICES FOR ELs AND THEIR FAMILIES (CONTINUED)",null,null,null,null,null,null,null,null,null,null,null,null,null,null,null,"E.  PROGRAMS AND SERVICES FOR ELs AND THEIR FAMILIES (CONTINUED)",null,null,null,null,null,null,null,null,null,null,null,null,null,null,null,"E.  PROGRAMS AND SERVICES FOR ELs AND THEIR FAMILIES (CONTINUED)",null,null,null,null,null,null,null,null,null,null,null,null,null,null,null,"E.  PROGRAMS AND SERVICES FOR ELs AND THEIR FAMILIES (CONTINUED)",null,null,null,null,null,null,null,null,null,null,null,null,null,null,null,"E.  PROGRAMS AND SERVICES FOR ELs AND THEIR FAMILIES (CONTINUED)",null,null,null,null,null,null,null,null,null,null,null,null,null,null,null,"E.  PROGRAMS AND SERVICES FOR ELs AND THEIR FAMILIES (CONTINUED)",null,null,null,null,null,null,null,null,null,null,null,null,null,null,null,"E.  PROGRAMS AND SERVICES FOR ELs AND THEIR FAMILIES (CONTINUED)",null,null,null,null,null,null,null,null,null,null,null,null,null,null,null,"E.  PROGRAMS AND SERVICES FOR ELs AND THEIR FAMILIES (CONTINUED)",null,null,null,null,null,null,null,null,null,null,null,null,null,null,null,"E.  PROGRAMS AND SERVICES FOR ELs AND THEIR FAMILIES (CONTINUED)",null,null,null,null,null,null,null,null,null,null,null,null,null,null,null,"E.  PROGRAMS AND SERVICES FOR ELs AND THEIR FAMILIES (CONTINUED)",null,null,null,null,null,null,null,null,null,null,null,null,null,null,null,"E.  PROGRAMS AND SERVICES FOR ELs AND THEIR FAMILIES (CONTINUED)",null,null,null,null,null,null,null,null,null,null,null,null,null,null,null,"E.  PROGRAMS AND SERVICES FOR ELs AND THEIR FAMILIES (CONTINUED)",null,null,null,null,null,null,null,null,null,null,null,null,null,null,null,"E.  PROGRAMS AND SERVICES FOR ELs AND THEIR FAMILIES (CONTINUED)",null,null,null,null,null,null,null,null,null,null,null,null,null,null,null,"E.  PROGRAMS AND SERVICES FOR ELs AND THEIR FAMILIES (CONTINUED)",null,null,null,null,null,null,null,null,null,null,null,null,null,null,null,"E.  PROGRAMS AND SERVICES FOR ELs AND THEIR FAMILIES (CONTINUED)",null,null,null,null,null,null,null,null,null,null,null,null,null,null,null,"E.  PROGRAMS AND SERVICES FOR ELs AND THEIR FAMILIES (CONTINUED)",null,null,null,null,null,null,null,null,null,null,null,null,null,null,null,"E.  PROGRAMS AND SERVICES FOR ELs AND THEIR FAMILIES (CONTINUED)",null,null,null,null,null,null,null,null,null,null,null,null,null,null,null,"E.  PROGRAMS AND SERVICES FOR ELs AND THEIR FAMILIES (CONTINUED)",null,null,null,null,null,null,null,null,null,null,null,null,null,null,null,"E.  PROGRAMS AND SERVICES FOR ELs AND THEIR FAMILIES (CONTINUED)",null,null,null,null,null,null,null,null,null,null,null,null,null,null,null,"E.  PROGRAMS AND SERVICES FOR ELs AND THEIR FAMILIES (CONTINUED)",null,null,null,null,null,null,null,null,null,null,null,null,null,null,null,"E.  PROGRAMS AND SERVICES FOR ELs AND THEIR FAMILIES (CONTINUED)",null,null,null,null,null,null,null,null,null,null,null,null,null,null,null,"E.  PROGRAMS AND SERVICES FOR ELs AND THEIR FAMILIES (CONTINUED)",null,null,null,null,null,null,null,null,null,null,null,null,null,null,null,"E.  PROGRAMS AND SERVICES FOR ELs AND THEIR FAMILIES (CONTINUED)",null,null,null,null,null,null,null,null,null,null,null,null,null,null,null,"E.  PROGRAMS AND SERVICES FOR ELs AND THEIR FAMILIES (CONTINUED)",null,null,null,null,null,null,null,null,null,null,null,null,null,null,null,"E.  PROGRAMS AND SERVICES FOR ELs AND THEIR FAMILIES (CONTINUED)",null,null,null,null,null,null,null,null,null,null,null,null,null,null,null,"E.  PROGRAMS AND SERVICES FOR ELs AND THEIR FAMILIES (CONTINUED)",null,null,null,null,null,null,null,null,null,null,null,null,null,null,null,"E.  PROGRAMS AND SERVICES FOR ELs AND THEIR FAMILIES (CONTINUED)",null,null,null,null,null,null,null,null,null,null,null,null,null,null,null,"E.  PROGRAMS AND SERVICES FOR ELs AND THEIR FAMILIES (CONTINUED)",null,null,null,null,null,null,null,null,null,null,null,null,null,null,null,"E.  PROGRAMS AND SERVICES FOR ELs AND THEIR FAMILIES (CONTINUED)",null,null,null,null,null,null,null,null,null,null,null,null,null,null,null,"E.  PROGRAMS AND SERVICES FOR ELs AND THEIR FAMILIES (CONTINUED)",null,null,null,null,null,null,null,null,null,null,null,null,null,null,null,"E.  PROGRAMS AND SERVICES FOR ELs AND THEIR FAMILIES (CONTINUED)",null,null,null,null,null,null,null,null,null,null,null,null,null,null,null,"E.  PROGRAMS AND SERVICES FOR ELs AND THEIR FAMILIES (CONTINUED)",null,null,null,null,null,null,null,null,null,null,null,null,null,null,null,"E.  PROGRAMS AND SERVICES FOR ELs AND THEIR FAMILIES (CONTINUED)",null,null,null,null,null,null,null,null,null,null,null,null,null,null,null,"E.  PROGRAMS AND SERVICES FOR ELs AND THEIR FAMILIES (CONTINUED)",null,null,null,null,null,null,null,null,null,null,null,null,null,null,null,"E.  PROGRAMS AND SERVICES FOR ELs AND THEIR FAMILIES (CONTINUED)",null,null,null,null,null,null,null,null,null,null,null,null,null,null,null,"E.  PROGRAMS AND SERVICES FOR ELs AND THEIR FAMILIES (CONTINUED)",null,null,null,null,null,null,null,null,null,null,null,null,null,null,null,"E.  PROGRAMS AND SERVICES FOR ELs AND THEIR FAMILIES (CONTINUED)",null,null,null,null,null,null,null,null,null,null,null,null,null,null,null,"E.  PROGRAMS AND SERVICES FOR ELs AND THEIR FAMILIES (CONTINUED)",null,null,null,null,null,null,null,null,null,null,null,null,null,null,null,"E.  PROGRAMS AND SERVICES FOR ELs AND THEIR FAMILIES (CONTINUED)",null,null,null,null,null,null,null,null,null,null,null,null,null,null,null,"E.  PROGRAMS AND SERVICES FOR ELs AND THEIR FAMILIES (CONTINUED)",null,null,null,null,null,null,null,null,null,null,null,null,null,null,null,"E.  PROGRAMS AND SERVICES FOR ELs AND THEIR FAMILIES (CONTINUED)",null,null,null,null,null,null,null,null,null,null,null,null,null,null,null,"E.  PROGRAMS AND SERVICES FOR ELs AND THEIR FAMILIES (CONTINUED)",null,null,null,null,null,null,null,null,null,null,null,null,null,null,null,"E.  PROGRAMS AND SERVICES FOR ELs AND THEIR FAMILIES (CONTINUED)",null,null,null,null,null,null,null,null,null,null,null,null,null,null,null,"E.  PROGRAMS AND SERVICES FOR ELs AND THEIR FAMILIES (CONTINUED)",null,null,null,null,null,null,null,null,null,null,null,null,null,null,null,"E.  PROGRAMS AND SERVICES FOR ELs AND THEIR FAMILIES (CONTINUED)",null,null,null,null,null,null,null,null,null,null,null,null,null,null,null,"E.  PROGRAMS AND SERVICES FOR ELs AND THEIR FAMILIES (CONTINUED)",null,null,null,null,null,null,null,null,null,null,null,null,null,null,null,"E.  PROGRAMS AND SERVICES FOR ELs AND THEIR FAMILIES (CONTINUED)",null,null,null,null,null,null,null,null,null,null,null,null,null,null,null,"E.  PROGRAMS AND SERVICES FOR ELs AND THEIR FAMILIES (CONTINUED)",null,null,null,null,null,null,null,null,null,null,null,null,null,null,null,"E.  PROGRAMS AND SERVICES FOR ELs AND THEIR FAMILIES (CONTINUED)",null,null,null,null,null,null,null,null,null,null,null,null,null,null,null,"E.  PROGRAMS AND SERVICES FOR ELs AND THEIR FAMILIES (CONTINUED)",null,null,null,null,null,null,null,null,null,null,null,null,null,null,null,"E.  PROGRAMS AND SERVICES FOR ELs AND THEIR FAMILIES (CONTINUED)",null,null,null,null,null,null,null,null,null,null,null,null,null,null,null,"E.  PROGRAMS AND SERVICES FOR ELs AND THEIR FAMILIES (CONTINUED)",null,null,null,null,null,null,null,null,null,null,null,null,null,null,null,"E.  PROGRAMS AND SERVICES FOR ELs AND THEIR FAMILIES (CONTINUED)",null,null,null,null,null,null,null,null,null,null,null,null,null,null,null,"E.  PROGRAMS AND SERVICES FOR ELs AND THEIR FAMILIES (CONTINUED)",null,null,null,null,null,null,null,null,null,null,null,null,null,null,null,"E.  PROGRAMS AND SERVICES FOR ELs AND THEIR FAMILIES (CONTINUED)",null,null,null,null,null,null,null,null,null,null,null,null,null,null,null,"E.  PROGRAMS AND SERVICES FOR ELs AND THEIR FAMILIES (CONTINUED)",null,null,null,null,null,null,null,null,null,null,null,null,null,null,null,"E.  PROGRAMS AND SERVICES FOR ELs AND THEIR FAMILIES (CONTINUED)",null,null,null,null,null,null,null,null,null,null,null,null,null,null,null,"E.  PROGRAMS AND SERVICES FOR ELs AND THEIR FAMILIES (CONTINUED)",null,null,null,null,null,null,null,null,null,null,null,null,null,null,null,"E.  PROGRAMS AND SERVICES FOR ELs AND THEIR FAMILIES (CONTINUED)",null,null,null,null,null,null,null,null,null,null,null,null,null,null,null,"E.  PROGRAMS AND SERVICES FOR ELs AND THEIR FAMILIES (CONTINUED)",null,null,null,null,null,null,null,null,null,null,null,null,null,null,null,"E.  PROGRAMS AND SERVICES FOR ELs AND THEIR FAMILIES (CONTINUED)",null,null,null,null,null,null,null,null,null,null,null,null,null,null,null,"E.  PROGRAMS AND SERVICES FOR ELs AND THEIR FAMILIES (CONTINUED)",null,null,null,null,null,null,null,null,null,null,null,null,null,null,null,"E.  PROGRAMS AND SERVICES FOR ELs AND THEIR FAMILIES (CONTINUED)",null,null,null,null,null,null,null,null,null,null,null,null,null,null,null,"E.  PROGRAMS AND SERVICES FOR ELs AND THEIR FAMILIES (CONTINUED)",null,null,null,null,null,null,null,null,null,null,null,null,null,null,null,"E.  PROGRAMS AND SERVICES FOR ELs AND THEIR FAMILIES (CONTINUED)",null,null,null,null,null,null,null,null,null,null,null,null,null,null,null,"E.  PROGRAMS AND SERVICES FOR ELs AND THEIR FAMILIES (CONTINUED)",null,null,null,null,null,null,null,null,null,null,null,null,null,null,null,"E.  PROGRAMS AND SERVICES FOR ELs AND THEIR FAMILIES (CONTINUED)",null,null,null,null,null,null,null,null,null,null,null,null,null,null,null,"E.  PROGRAMS AND SERVICES FOR ELs AND THEIR FAMILIES (CONTINUED)",null,null,null,null,null,null,null,null,null,null,null,null,null,null,null,"E.  PROGRAMS AND SERVICES FOR ELs AND THEIR FAMILIES (CONTINUED)",null,null,null,null,null,null,null,null,null,null,null,null,null,null,null,"E.  PROGRAMS AND SERVICES FOR ELs AND THEIR FAMILIES (CONTINUED)",null,null,null,null,null,null,null,null,null,null,null,null,null,null,null,"E.  PROGRAMS AND SERVICES FOR ELs AND THEIR FAMILIES (CONTINUED)",null,null,null,null,null,null,null,null,null,null,null,null,null,null,null,"E.  PROGRAMS AND SERVICES FOR ELs AND THEIR FAMILIES (CONTINUED)",null,null,null,null,null,null,null,null,null,null,null,null,null,null,null,"E.  PROGRAMS AND SERVICES FOR ELs AND THEIR FAMILIES (CONTINUED)",null,null,null,null,null,null,null,null,null,null,null,null,null,null,null,"E.  PROGRAMS AND SERVICES FOR ELs AND THEIR FAMILIES (CONTINUED)",null,null,null,null,null,null,null,null,null,null,null,null,null,null,null,"E.  PROGRAMS AND SERVICES FOR ELs AND THEIR FAMILIES (CONTINUED)",null,null,null,null,null,null,null,null,null,null,null,null,null,null,null,"E.  PROGRAMS AND SERVICES FOR ELs AND THEIR FAMILIES (CONTINUED)",null,null,null,null,null,null,null,null,null,null,null,null,null,null,null,"E.  PROGRAMS AND SERVICES FOR ELs AND THEIR FAMILIES (CONTINUED)",null,null,null,null,null,null,null,null,null,null,null,null,null,null,null,"E.  PROGRAMS AND SERVICES FOR ELs AND THEIR FAMILIES (CONTINUED)",null,null,null,null,null,null,null,null,null,null,null,null,null,null,null,"E.  PROGRAMS AND SERVICES FOR ELs AND THEIR FAMILIES (CONTINUED)",null,null,null,null,null,null,null,null,null,null,null,null,null,null,null,"E.  PROGRAMS AND SERVICES FOR ELs AND THEIR FAMILIES (CONTINUED)",null,null,null,null,null,null,null,null,null,null,null,null,null,null,null,"E.  PROGRAMS AND SERVICES FOR ELs AND THEIR FAMILIES (CONTINUED)",null,null,null,null,null,null,null,null,null,null,null,null,null,null,null,"E.  PROGRAMS AND SERVICES FOR ELs AND THEIR FAMILIES (CONTINUED)",null,null,null,null,null,null,null,null,null,null,null,null,null,null,null,"E.  PROGRAMS AND SERVICES FOR ELs AND THEIR FAMILIES (CONTINUED)",null,null,null,null,null,null,null,null,null,null,null,null,null,null,null,"E.  PROGRAMS AND SERVICES FOR ELs AND THEIR FAMILIES (CONTINUED)",null,null,null,null,null,null,null,null,null,null,null,null,null,null,null,"E.  PROGRAMS AND SERVICES FOR ELs AND THEIR FAMILIES (CONTINUED)",null,null,null,null,null,null,null,null,null,null,null,null,null,null,null,"E.  PROGRAMS AND SERVICES FOR ELs AND THEIR FAMILIES (CONTINUED)",null,null,null,null,null,null,null,null,null,null,null,null,null,null,null,"E.  PROGRAMS AND SERVICES FOR ELs AND THEIR FAMILIES (CONTINUED)",null,null,null,null,null,null,null,null,null,null,null,null,null,null,null,"E.  PROGRAMS AND SERVICES FOR ELs AND THEIR FAMILIES (CONTINUED)",null,null,null,null,null,null,null,null,null,null,null,null,null,null,null,"E.  PROGRAMS AND SERVICES FOR ELs AND THEIR FAMILIES (CONTINUED)",null,null,null,null,null,null,null,null,null,null,null,null,null,null,null,"E.  PROGRAMS AND SERVICES FOR ELs AND THEIR FAMILIES (CONTINUED)",null,null,null,null,null,null,null,null,null,null,null,null,null,null,null,"E.  PROGRAMS AND SERVICES FOR ELs AND THEIR FAMILIES (CONTINUED)",null,null,null,null,null,null,null,null,null,null,null,null,null,null,null,"E.  PROGRAMS AND SERVICES FOR ELs AND THEIR FAMILIES (CONTINUED)",null,null,null,null,null,null,null,null,null,null,null,null,null,null,null,"E.  PROGRAMS AND SERVICES FOR ELs AND THEIR FAMILIES (CONTINUED)",null,null,null,null,null,null,null,null,null,null,null,null,null,null,null,"E.  PROGRAMS AND SERVICES FOR ELs AND THEIR FAMILIES (CONTINUED)",null,null,null,null,null,null,null,null,null,null,null,null,null,null,null,"E.  PROGRAMS AND SERVICES FOR ELs AND THEIR FAMILIES (CONTINUED)",null,null,null,null,null,null,null,null,null,null,null,null,null,null,null,"E.  PROGRAMS AND SERVICES FOR ELs AND THEIR FAMILIES (CONTINUED)",null,null,null,null,null,null,null,null,null,null,null,null,null,null,null,"E.  PROGRAMS AND SERVICES FOR ELs AND THEIR FAMILIES (CONTINUED)",null,null,null,null,null,null,null,null,null,null,null,null,null,null,null,"E.  PROGRAMS AND SERVICES FOR ELs AND THEIR FAMILIES (CONTINUED)",null,null,null,null,null,null,null,null,null,null,null,null,null,null,null,"E.  PROGRAMS AND SERVICES FOR ELs AND THEIR FAMILIES (CONTINUED)",null,null,null,null,null,null,null,null,null,null,null,null,null,null,null,"E.  PROGRAMS AND SERVICES FOR ELs AND THEIR FAMILIES (CONTINUED)",null,null,null,null,null,null,null,null,null,null,null,null,null,null,null,"E.  PROGRAMS AND SERVICES FOR ELs AND THEIR FAMILIES (CONTINUED)",null,null,null,null,null,null,null,null,null,null,null,null,null,null,null,"E.  PROGRAMS AND SERVICES FOR ELs AND THEIR FAMILIES (CONTINUED)",null,null,null,null,null,null,null,null,null,null,null,null,null,null,null,"E.  PROGRAMS AND SERVICES FOR ELs AND THEIR FAMILIES (CONTINUED)",null,null,null,null,null,null,null,null,null,null,null,null,null,null,null,"E.  PROGRAMS AND SERVICES FOR ELs AND THEIR FAMILIES (CONTINUED)",null,null,null,null,null,null,null,null,null,null,null,null,null,null,null,"E.  PROGRAMS AND SERVICES FOR ELs AND THEIR FAMILIES (CONTINUED)",null,null,null,null,null,null,null,null,null,null,null,null,null,null,null,"E.  PROGRAMS AND SERVICES FOR ELs AND THEIR FAMILIES (CONTINUED)",null,null,null,null,null,null,null,null,null,null,null,null,null,null,null,"E.  PROGRAMS AND SERVICES FOR ELs AND THEIR FAMILIES (CONTINUED)",null,null,null,null,null,null,null,null,null,null,null,null,null,null,null,"E.  PROGRAMS AND SERVICES FOR ELs AND THEIR FAMILIES (CONTINUED)",null,null,null,null,null,null,null,null,null,null,null,null,null,null,null,"E.  PROGRAMS AND SERVICES FOR ELs AND THEIR FAMILIES (CONTINUED)",null,null,null,null,null,null,null,null,null,null,null,null,null,null,null,"E.  PROGRAMS AND SERVICES FOR ELs AND THEIR FAMILIES (CONTINUED)",null,null,null,null,null,null,null,null,null,null,null,null,null,null,null,"E.  PROGRAMS AND SERVICES FOR ELs AND THEIR FAMILIES (CONTINUED)",null,null,null,null,null,null,null,null,null,null,null,null,null,null,null,"E.  PROGRAMS AND SERVICES FOR ELs AND THEIR FAMILIES (CONTINUED)",null,null,null,null,null,null,null,null,null,null,null,null,null,null,null,"E.  PROGRAMS AND SERVICES FOR ELs AND THEIR FAMILIES (CONTINUED)",null,null,null,null,null,null,null,null,null,null,null,null,null,null,null,"E.  PROGRAMS AND SERVICES FOR ELs AND THEIR FAMILIES (CONTINUED)",null,null,null,null,null,null,null,null,null,null,null,null,null,null,null,"E.  PROGRAMS AND SERVICES FOR ELs AND THEIR FAMILIES (CONTINUED)",null,null,null,null,null,null,null,null,null,null,null,null,null,null,null,"E.  PROGRAMS AND SERVICES FOR ELs AND THEIR FAMILIES (CONTINUED)",null,null,null,null,null,null,null,null,null,null,null,null,null,null,null,"E.  PROGRAMS AND SERVICES FOR ELs AND THEIR FAMILIES (CONTINUED)",null,null,null,null,null,null,null,null,null,null,null,null,null,null,null,"E.  PROGRAMS AND SERVICES FOR ELs AND THEIR FAMILIES (CONTINUED)",null,null,null,null,null,null,null,null,null,null,null,null,null,null,null,"E.  PROGRAMS AND SERVICES FOR ELs AND THEIR FAMILIES (CONTINUED)",null,null,null,null,null,null,null,null,null,null,null,null,null,null,null,"E.  PROGRAMS AND SERVICES FOR ELs AND THEIR FAMILIES (CONTINUED)",null,null,null,null,null,null,null,null,null,null,null,null,null,null,null,"E.  PROGRAMS AND SERVICES FOR ELs AND THEIR FAMILIES (CONTINUED)",null,null,null,null,null,null,null,null,null,null,null,null,null,null,null,"E.  PROGRAMS AND SERVICES FOR ELs AND THEIR FAMILIES (CONTINUED)",null,null,null,null,null,null,null,null,null,null,null,null,null,null,null,"E.  PROGRAMS AND SERVICES FOR ELs AND THEIR FAMILIES (CONTINUED)",null,null,null,null,null,null,null,null,null,null,null,null,null,null,null,"E.  PROGRAMS AND SERVICES FOR ELs AND THEIR FAMILIES (CONTINUED)",null,null,null,null,null,null,null,null,null,null,null,null,null,null,null,"E.  PROGRAMS AND SERVICES FOR ELs AND THEIR FAMILIES (CONTINUED)",null,null,null,null,null,null,null,null,null,null,null,null,null,null,null,"E.  PROGRAMS AND SERVICES FOR ELs AND THEIR FAMILIES (CONTINUED)",null,null,null,null,null,null,null,null,null,null,null,null,null,null,null,"E.  PROGRAMS AND SERVICES FOR ELs AND THEIR FAMILIES (CONTINUED)",null,null,null,null,null,null,null,null,null,null,null,null,null,null,null,"E.  PROGRAMS AND SERVICES FOR ELs AND THEIR FAMILIES (CONTINUED)",null,null,null,null,null,null,null,null,null,null,null,null,null,null,null,"E.  PROGRAMS AND SERVICES FOR ELs AND THEIR FAMILIES (CONTINUED)",null,null,null,null,null,null,null,null,null,null,null,null,null,null,null,"E.  PROGRAMS AND SERVICES FOR ELs AND THEIR FAMILIES (CONTINUED)",null,null,null,null,null,null,null,null,null,null,null,null,null,null,null,"E.  PROGRAMS AND SERVICES FOR ELs AND THEIR FAMILIES (CONTINUED)",null,null,null,null,null,null,null,null,null,null,null,null,null,null,null,"E.  PROGRAMS AND SERVICES FOR ELs AND THEIR FAMILIES (CONTINUED)",null,null,null,null,null,null,null,null,null,null,null,null,null,null,null,"E.  PROGRAMS AND SERVICES FOR ELs AND THEIR FAMILIES (CONTINUED)",null,null,null,null,null,null,null,null,null,null,null,null,null,null,null,"E.  PROGRAMS AND SERVICES FOR ELs AND THEIR FAMILIES (CONTINUED)",null,null,null,null,null,null,null,null,null,null,null,null,null,null,null,"E.  PROGRAMS AND SERVICES FOR ELs AND THEIR FAMILIES (CONTINUED)",null,null,null,null,null,null,null,null,null,null,null,null,null,null,null,"E.  PROGRAMS AND SERVICES FOR ELs AND THEIR FAMILIES (CONTINUED)",null,null,null,null,null,null,null,null,null,null,null,null,null,null,null,"E.  PROGRAMS AND SERVICES FOR ELs AND THEIR FAMILIES (CONTINUED)",null,null,null,null,null,null,null,null,null,null,null,null,null,null,null,"E.  PROGRAMS AND SERVICES FOR ELs AND THEIR FAMILIES (CONTINUED)",null,null,null,null,null,null,null,null,null,null,null,null,null,null,null,"E.  PROGRAMS AND SERVICES FOR ELs AND THEIR FAMILIES (CONTINUED)",null,null,null,null,null,null,null,null,null,null,null,null,null,null,null,"E.  PROGRAMS AND SERVICES FOR ELs AND THEIR FAMILIES (CONTINUED)",null,null,null,null,null,null,null,null,null,null,null,null,null,null,null,"E.  PROGRAMS AND SERVICES FOR ELs AND THEIR FAMILIES (CONTINUED)",null,null,null,null,null,null,null,null,null,null,null,null,null,null,null,"E.  PROGRAMS AND SERVICES FOR ELs AND THEIR FAMILIES (CONTINUED)",null,null,null,null,null,null,null,null,null,null,null,null,null,null,null,"E.  PROGRAMS AND SERVICES FOR ELs AND THEIR FAMILIES (CONTINUED)",null,null,null,null,null,null,null,null,null,null,null,null,null,null,null,"E.  PROGRAMS AND SERVICES FOR ELs AND THEIR FAMILIES (CONTINUED)",null,null,null,null,null,null,null,null,null,null,null,null,null,null,null,"E.  PROGRAMS AND SERVICES FOR ELs AND THEIR FAMILIES (CONTINUED)",null,null,null,null,null,null,null,null,null,null,null,null,null,null,null,"E.  PROGRAMS AND SERVICES FOR ELs AND THEIR FAMILIES (CONTINUED)",null,null,null,null,null,null,null,null,null,null,null,null,null,null,null,"E.  PROGRAMS AND SERVICES FOR ELs AND THEIR FAMILIES (CONTINUED)",null,null,null,null,null,null,null,null,null,null,null,null,null,null,null,"E.  PROGRAMS AND SERVICES FOR ELs AND THEIR FAMILIES (CONTINUED)",null,null,null,null,null,null,null,null,null,null,null,null,null,null,null,"E.  PROGRAMS AND SERVICES FOR ELs AND THEIR FAMILIES (CONTINUED)",null,null,null,null,null,null,null,null,null,null,null,null,null,null,null,"E.  PROGRAMS AND SERVICES FOR ELs AND THEIR FAMILIES (CONTINUED)",null,null,null,null,null,null,null,null,null,null,null,null,null,null,null,"E.  PROGRAMS AND SERVICES FOR ELs AND THEIR FAMILIES (CONTINUED)",null,null,null,null,null,null,null,null,null,null,null,null,null,null,null,"E.  PROGRAMS AND SERVICES FOR ELs AND THEIR FAMILIES (CONTINUED)",null,null,null,null,null,null,null,null,null,null,null,null,null,null,null,"E.  PROGRAMS AND SERVICES FOR ELs AND THEIR FAMILIES (CONTINUED)",null,null,null,null,null,null,null,null,null,null,null,null,null,null,null,"E.  PROGRAMS AND SERVICES FOR ELs AND THEIR FAMILIES (CONTINUED)",null,null,null,null,null,null,null,null,null,null,null,null,null,null,null,"E.  PROGRAMS AND SERVICES FOR ELs AND THEIR FAMILIES (CONTINUED)",null,null,null,null,null,null,null,null,null,null,null,null,null,null,null,"E.  PROGRAMS AND SERVICES FOR ELs AND THEIR FAMILIES (CONTINUED)",null,null,null,null,null,null,null,null,null,null,null,null,null,null,null,"E.  PROGRAMS AND SERVICES FOR ELs AND THEIR FAMILIES (CONTINUED)",null,null,null,null,null,null,null,null,null,null,null,null,null,null,null,"E.  PROGRAMS AND SERVICES FOR ELs AND THEIR FAMILIES (CONTINUED)",null,null,null,null,null,null,null,null,null,null,null,null,null,null,null,"E.  PROGRAMS AND SERVICES FOR ELs AND THEIR FAMILIES (CONTINUED)",null,null,null,null,null,null,null,null,null,null,null,null,null,null,null,"E.  PROGRAMS AND SERVICES FOR ELs AND THEIR FAMILIES (CONTINUED)",null,null,null,null,null,null,null,null,null,null,null,null,null,null,null,"E.  PROGRAMS AND SERVICES FOR ELs AND THEIR FAMILIES (CONTINUED)",null,null,null,null,null,null,null,null,null,null,null,null,null,null,null,"E.  PROGRAMS AND SERVICES FOR ELs AND THEIR FAMILIES (CONTINUED)",null,null,null,null,null,null,null,null,null,null,null,null,null,null,null,"E.  PROGRAMS AND SERVICES FOR ELs AND THEIR FAMILIES (CONTINUED)",null,null,null,null,null,null,null,null,null,null,null,null,null,null,null,"E.  PROGRAMS AND SERVICES FOR ELs AND THEIR FAMILIES (CONTINUED)",null,null,null,null,null,null,null,null,null,null,null,null,null,null,null,"E.  PROGRAMS AND SERVICES FOR ELs AND THEIR FAMILIES (CONTINUED)",null,null,null,null,null,null,null,null,null,null,null,null,null,null,null,"E.  PROGRAMS AND SERVICES FOR ELs AND THEIR FAMILIES (CONTINUED)",null,null,null,null,null,null,null,null,null,null,null,null,null,null,null,"E.  PROGRAMS AND SERVICES FOR ELs AND THEIR FAMILIES (CONTINUED)",null,null,null,null,null,null,null,null,null,null,null,null,null,null,null,"E.  PROGRAMS AND SERVICES FOR ELs AND THEIR FAMILIES (CONTINUED)",null,null,null,null,null,null,null,null,null,null,null,null,null,null,null,"E.  PROGRAMS AND SERVICES FOR ELs AND THEIR FAMILIES (CONTINUED)",null,null,null,null,null,null,null,null,null,null,null,null,null,null,null,"E.  PROGRAMS AND SERVICES FOR ELs AND THEIR FAMILIES (CONTINUED)",null,null,null,null,null,null,null,null,null,null,null,null,null,null,null,"E.  PROGRAMS AND SERVICES FOR ELs AND THEIR FAMILIES (CONTINUED)",null,null,null,null,null,null,null,null,null,null,null,null,null,null,null,"E.  PROGRAMS AND SERVICES FOR ELs AND THEIR FAMILIES (CONTINUED)",null,null,null,null,null,null,null,null,null,null,null,null,null,null,null,"E.  PROGRAMS AND SERVICES FOR ELs AND THEIR FAMILIES (CONTINUED)",null,null,null,null,null,null,null,null,null,null,null,null,null,null,null,"E.  PROGRAMS AND SERVICES FOR ELs AND THEIR FAMILIES (CONTINUED)",null,null,null,null,null,null,null,null,null,null,null,null,null,null,null,"E.  PROGRAMS AND SERVICES FOR ELs AND THEIR FAMILIES (CONTINUED)",null,null,null,null,null,null,null,null,null,null,null,null,null,null,null,"E.  PROGRAMS AND SERVICES FOR ELs AND THEIR FAMILIES (CONTINUED)",null,null,null,null,null,null,null,null,null,null,null,null,null,null,null,"E.  PROGRAMS AND SERVICES FOR ELs AND THEIR FAMILIES (CONTINUED)",null,null,null,null,null,null,null,null,null,null,null,null,null,null,null,"E.  PROGRAMS AND SERVICES FOR ELs AND THEIR FAMILIES (CONTINUED)",null,null,null,null,null,null,null,null,null,null,null,null,null,null,null,"E.  PROGRAMS AND SERVICES FOR ELs AND THEIR FAMILIES (CONTINUED)",null,null,null,null,null,null,null,null,null,null,null,null,null,null,null,"E.  PROGRAMS AND SERVICES FOR ELs AND THEIR FAMILIES (CONTINUED)",null,null,null,null,null,null,null,null,null,null,null,null,null,null,null,"E.  PROGRAMS AND SERVICES FOR ELs AND THEIR FAMILIES (CONTINUED)",null,null,null,null,null,null,null,null,null,null,null,null,null,null,null,"E.  PROGRAMS AND SERVICES FOR ELs AND THEIR FAMILIES (CONTINUED)",null,null,null,null,null,null,null,null,null,null,null,null,null,null,null,"E.  PROGRAMS AND SERVICES FOR ELs AND THEIR FAMILIES (CONTINUED)",null,null,null,null,null,null,null,null,null,null,null,null,null,null,null,"E.  PROGRAMS AND SERVICES FOR ELs AND THEIR FAMILIES (CONTINUED)",null,null,null,null,null,null,null,null,null,null,null,null,null,null,null,"E.  PROGRAMS AND SERVICES FOR ELs AND THEIR FAMILIES (CONTINUED)",null,null,null,null,null,null,null,null,null,null,null,null,null,null,null,"E.  PROGRAMS AND SERVICES FOR ELs AND THEIR FAMILIES (CONTINUED)",null,null,null,null,null,null,null,null,null,null,null,null,null,null,null,"E.  PROGRAMS AND SERVICES FOR ELs AND THEIR FAMILIES (CONTINUED)",null,null,null,null,null,null,null,null,null,null,null,null,null,null,null,"E.  PROGRAMS AND SERVICES FOR ELs AND THEIR FAMILIES (CONTINUED)",null,null,null,null,null,null,null,null,null,null,null,null,null,null,null,"E.  PROGRAMS AND SERVICES FOR ELs AND THEIR FAMILIES (CONTINUED)",null,null,null,null,null,null,null,null,null,null,null,null,null,null,null,"E.  PROGRAMS AND SERVICES FOR ELs AND THEIR FAMILIES (CONTINUED)",null,null,null,null,null,null,null,null,null,null,null,null,null,null,null,"E.  PROGRAMS AND SERVICES FOR ELs AND THEIR FAMILIES (CONTINUED)",null,null,null,null,null,null,null,null,null,null,null,null,null,null,null,"E.  PROGRAMS AND SERVICES FOR ELs AND THEIR FAMILIES (CONTINUED)",null,null,null,null,null,null,null,null,null,null,null,null,null,null,null,"E.  PROGRAMS AND SERVICES FOR ELs AND THEIR FAMILIES (CONTINUED)",null,null,null,null,null,null,null,null,null,null,null,null,null,null,null,"E.  PROGRAMS AND SERVICES FOR ELs AND THEIR FAMILIES (CONTINUED)",null,null,null,null,null,null,null,null,null,null,null,null,null,null,null,"E.  PROGRAMS AND SERVICES FOR ELs AND THEIR FAMILIES (CONTINUED)",null,null,null,null,null,null,null,null,null,null,null,null,null,null,null,"E.  PROGRAMS AND SERVICES FOR ELs AND THEIR FAMILIES (CONTINUED)",null,null,null,null,null,null,null,null,null,null,null,null,null,null,null,"E.  PROGRAMS AND SERVICES FOR ELs AND THEIR FAMILIES (CONTINUED)",null,null,null,null,null,null,null,null,null,null,null,null,null,null,null,"E.  PROGRAMS AND SERVICES FOR ELs AND THEIR FAMILIES (CONTINUED)",null,null,null,null,null,null,null,null,null,null,null,null,null,null,null,"E.  PROGRAMS AND SERVICES FOR ELs AND THEIR FAMILIES (CONTINUED)",null,null,null,null,null,null,null,null,null,null,null,null,null,null,null,"E.  PROGRAMS AND SERVICES FOR ELs AND THEIR FAMILIES (CONTINUED)",null,null,null,null,null,null,null,null,null,null,null,null,null,null,null,"E.  PROGRAMS AND SERVICES FOR ELs AND THEIR FAMILIES (CONTINUED)",null,null,null,null,null,null,null,null,null,null,null,null,null,null,null,"E.  PROGRAMS AND SERVICES FOR ELs AND THEIR FAMILIES (CONTINUED)",null,null,null,null,null,null,null,null,null,null,null,null,null,null,null,"E.  PROGRAMS AND SERVICES FOR ELs AND THEIR FAMILIES (CONTINUED)",null,null,null,null,null,null,null,null,null,null,null,null,null,null,null,"E.  PROGRAMS AND SERVICES FOR ELs AND THEIR FAMILIES (CONTINUED)",null,null,null,null,null,null,null,null,null,null,null,null,null,null,null,"E.  PROGRAMS AND SERVICES FOR ELs AND THEIR FAMILIES (CONTINUED)",null,null,null,null,null,null,null,null,null,null,null,null,null,null,null,"E.  PROGRAMS AND SERVICES FOR ELs AND THEIR FAMILIES (CONTINUED)",null,null,null,null,null,null,null,null,null,null,null,null,null,null,null,"E.  PROGRAMS AND SERVICES FOR ELs AND THEIR FAMILIES (CONTINUED)",null,null,null,null,null,null,null,null,null,null,null,null,null,null,null,"E.  PROGRAMS AND SERVICES FOR ELs AND THEIR FAMILIES (CONTINUED)",null,null,null,null,null,null,null,null,null,null,null,null,null,null,null,"E.  PROGRAMS AND SERVICES FOR ELs AND THEIR FAMILIES (CONTINUED)",null,null,null,null,null,null,null,null,null,null,null,null,null,null,null,"E.  PROGRAMS AND SERVICES FOR ELs AND THEIR FAMILIES (CONTINUED)",null,null,null,null,null,null,null,null,null,null,null,null,null,null,null,"E.  PROGRAMS AND SERVICES FOR ELs AND THEIR FAMILIES (CONTINUED)",null,null,null,null,null,null,null,null,null,null,null,null,null,null,null,"E.  PROGRAMS AND SERVICES FOR ELs AND THEIR FAMILIES (CONTINUED)",null,null,null,null,null,null,null,null,null,null,null,null,null,null,null,"E.  PROGRAMS AND SERVICES FOR ELs AND THEIR FAMILIES (CONTINUED)",null,null,null,null,null,null,null,null,null,null,null,null,null,null,null,"E.  PROGRAMS AND SERVICES FOR ELs AND THEIR FAMILIES (CONTINUED)",null,null,null,null,null,null,null,null,null,null,null,null,null,null,null,"E.  PROGRAMS AND SERVICES FOR ELs AND THEIR FAMILIES (CONTINUED)",null,null,null,null,null,null,null,null,null,null,null,null,null,null,null,"E.  PROGRAMS AND SERVICES FOR ELs AND THEIR FAMILIES (CONTINUED)",null,null,null,null,null,null,null,null,null,null,null,null,null,null,null,"E.  PROGRAMS AND SERVICES FOR ELs AND THEIR FAMILIES (CONTINUED)",null,null,null,null,null,null,null,null,null,null,null,null,null,null,null,"E.  PROGRAMS AND SERVICES FOR ELs AND THEIR FAMILIES (CONTINUED)",null,null,null,null,null,null,null,null,null,null,null,null,null,null,null,"E.  PROGRAMS AND SERVICES FOR ELs AND THEIR FAMILIES (CONTINUED)",null,null,null,null,null,null,null,null,null,null,null,null,null,null,null,"E.  PROGRAMS AND SERVICES FOR ELs AND THEIR FAMILIES (CONTINUED)",null,null,null,null,null,null,null,null,null,null,null,null,null,null,null,"E.  PROGRAMS AND SERVICES FOR ELs AND THEIR FAMILIES (CONTINUED)",null,null,null,null,null,null,null,null,null,null,null,null,null,null,null,"E.  PROGRAMS AND SERVICES FOR ELs AND THEIR FAMILIES (CONTINUED)",null,null,null,null,null,null,null,null,null,null,null,null,null,null,null,"E.  PROGRAMS AND SERVICES FOR ELs AND THEIR FAMILIES (CONTINUED)",null,null,null,null,null,null,null,null,null,null,null,null,null,null,null,"E.  PROGRAMS AND SERVICES FOR ELs AND THEIR FAMILIES (CONTINUED)",null,null,null,null,null,null,null,null,null,null,null,null,null,null,null,"E.  PROGRAMS AND SERVICES FOR ELs AND THEIR FAMILIES (CONTINUED)",null,null,null,null,null,null,null,null,null,null,null,null,null,null,null,"E.  PROGRAMS AND SERVICES FOR ELs AND THEIR FAMILIES (CONTINUED)",null,null,null,null,null,null,null,null,null,null,null,null,null,null,null,"E.  PROGRAMS AND SERVICES FOR ELs AND THEIR FAMILIES (CONTINUED)",null,null,null,null,null,null,null,null,null,null,null,null,null,null,null,"E.  PROGRAMS AND SERVICES FOR ELs AND THEIR FAMILIES (CONTINUED)",null,null,null,null,null,null,null,null,null,null,null,null,null,null,null,"E.  PROGRAMS AND SERVICES FOR ELs AND THEIR FAMILIES (CONTINUED)",null,null,null,null,null,null,null,null,null,null,null,null,null,null,null,"E.  PROGRAMS AND SERVICES FOR ELs AND THEIR FAMILIES (CONTINUED)",null,null,null,null,null,null,null,null,null,null,null,null,null,null,null,"E.  PROGRAMS AND SERVICES FOR ELs AND THEIR FAMILIES (CONTINUED)",null,null,null,null,null,null,null,null,null,null,null,null,null,null,null,"E.  PROGRAMS AND SERVICES FOR ELs AND THEIR FAMILIES (CONTINUED)",null,null,null,null,null,null,null,null,null,null,null,null,null,null,null,"E.  PROGRAMS AND SERVICES FOR ELs AND THEIR FAMILIES (CONTINUED)",null,null,null,null,null,null,null,null,null,null,null,null,null,null,null,"E.  PROGRAMS AND SERVICES FOR ELs AND THEIR FAMILIES (CONTINUED)",null,null,null,null,null,null,null,null,null,null,null,null,null,null,null,"E.  PROGRAMS AND SERVICES FOR ELs AND THEIR FAMILIES (CONTINUED)",null,null,null,null,null,null,null,null,null,null,null,null,null,null,null,"E.  PROGRAMS AND SERVICES FOR ELs AND THEIR FAMILIES (CONTINUED)",null,null,null,null,null,null,null,null,null,null,null,null,null,null,null,"E.  PROGRAMS AND SERVICES FOR ELs AND THEIR FAMILIES (CONTINUED)",null,null,null,null,null,null,null,null,null,null,null,null,null,null,null,"E.  PROGRAMS AND SERVICES FOR ELs AND THEIR FAMILIES (CONTINUED)",null,null,null,null,null,null,null,null,null,null,null,null,null,null,null,"E.  PROGRAMS AND SERVICES FOR ELs AND THEIR FAMILIES (CONTINUED)",null,null,null,null,null,null,null,null,null,null,null,null,null,null,null,"E.  PROGRAMS AND SERVICES FOR ELs AND THEIR FAMILIES (CONTINUED)",null,null,null,null,null,null,null,null,null,null,null,null,null,null,null,"E.  PROGRAMS AND SERVICES FOR ELs AND THEIR FAMILIES (CONTINUED)",null,null,null,null,null,null,null,null,null,null,null,null,null,null,null,"E.  PROGRAMS AND SERVICES FOR ELs AND THEIR FAMILIES (CONTINUED)",null,null,null,null,null,null,null,null,null,null,null,null,null,null,null,"E.  PROGRAMS AND SERVICES FOR ELs AND THEIR FAMILIES (CONTINUED)",null,null,null,null,null,null,null,null,null,null,null,null,null,null,null,"E.  PROGRAMS AND SERVICES FOR ELs AND THEIR FAMILIES (CONTINUED)",null,null,null,null,null,null,null,null,null,null,null,null,null,null,null,"E.  PROGRAMS AND SERVICES FOR ELs AND THEIR FAMILIES (CONTINUED)",null,null,null,null,null,null,null,null,null,null,null,null,null,null,null,"E.  PROGRAMS AND SERVICES FOR ELs AND THEIR FAMILIES (CONTINUED)",null,null,null,null,null,null,null,null,null,null,null,null,null,null,null,"E.  PROGRAMS AND SERVICES FOR ELs AND THEIR FAMILIES (CONTINUED)",null,null,null,null,null,null,null,null,null,null,null,null,null,null,null,"E.  PROGRAMS AND SERVICES FOR ELs AND THEIR FAMILIES (CONTINUED)",null,null,null,null,null,null,null,null,null,null,null,null,null,null,null,"E.  PROGRAMS AND SERVICES FOR ELs AND THEIR FAMILIES (CONTINUED)",null,null,null,null,null,null,null,null,null,null,null,null,null,null,null,"E.  PROGRAMS AND SERVICES FOR ELs AND THEIR FAMILIES (CONTINUED)",null,null,null,null,null,null,null,null,null,null,null,null,null,null,null,"E.  PROGRAMS AND SERVICES FOR ELs AND THEIR FAMILIES (CONTINUED)",null,null,null,null,null,null,null,null,null,null,null,null,null,null,null,"E.  PROGRAMS AND SERVICES FOR ELs AND THEIR FAMILIES (CONTINUED)",null,null,null,null,null,null,null,null,null,null,null,null,null,null,null,"E.  PROGRAMS AND SERVICES FOR ELs AND THEIR FAMILIES (CONTINUED)",null,null,null,null,null,null,null,null,null,null,null,null,null,null,null,"E.  PROGRAMS AND SERVICES FOR ELs AND THEIR FAMILIES (CONTINUED)",null,null,null,null,null,null,null,null,null,null,null,null,null,null,null,"E.  PROGRAMS AND SERVICES FOR ELs AND THEIR FAMILIES (CONTINUED)",null,null,null,null,null,null,null,null,null,null,null,null,null,null,null,"E.  PROGRAMS AND SERVICES FOR ELs AND THEIR FAMILIES (CONTINUED)",null,null,null,null,null,null,null,null,null,null,null,null,null,null,null,"E.  PROGRAMS AND SERVICES FOR ELs AND THEIR FAMILIES (CONTINUED)",null,null,null,null,null,null,null,null,null,null,null,null,null,null,null,"E.  PROGRAMS AND SERVICES FOR ELs AND THEIR FAMILIES (CONTINUED)",null,null,null,null,null,null,null,null,null,null,null,null,null,null,null,"E.  PROGRAMS AND SERVICES FOR ELs AND THEIR FAMILIES (CONTINUED)",null,null,null,null,null,null,null,null,null,null,null,null,null,null,null,"E.  PROGRAMS AND SERVICES FOR ELs AND THEIR FAMILIES (CONTINUED)",null,null,null,null,null,null,null,null,null,null,null,null,null,null,null,"E.  PROGRAMS AND SERVICES FOR ELs AND THEIR FAMILIES (CONTINUED)",null,null,null,null,null,null,null,null,null,null,null,null,null,null,null,"E.  PROGRAMS AND SERVICES FOR ELs AND THEIR FAMILIES (CONTINUED)",null,null,null,null,null,null,null,null,null,null,null,null,null,null,null,"E.  PROGRAMS AND SERVICES FOR ELs AND THEIR FAMILIES (CONTINUED)",null,null,null,null,null,null,null,null,null,null,null,null,null,null,null,"E.  PROGRAMS AND SERVICES FOR ELs AND THEIR FAMILIES (CONTINUED)",null,null,null,null,null,null,null,null,null,null,null,null,null,null,null,"E.  PROGRAMS AND SERVICES FOR ELs AND THEIR FAMILIES (CONTINUED)",null,null,null,null,null,null,null,null,null,null,null,null,null,null,null,"E.  PROGRAMS AND SERVICES FOR ELs AND THEIR FAMILIES (CONTINUED)",null,null,null,null,null,null,null,null,null,null,null,null,null,null,null,"E.  PROGRAMS AND SERVICES FOR ELs AND THEIR FAMILIES (CONTINUED)",null,null,null,null,null,null,null,null,null,null,null,null,null,null,null,"E.  PROGRAMS AND SERVICES FOR ELs AND THEIR FAMILIES (CONTINUED)",null,null,null,null,null,null,null,null,null,null,null,null,null,null,null,"E.  PROGRAMS AND SERVICES FOR ELs AND THEIR FAMILIES (CONTINUED)",null,null,null,null,null,null,null,null,null,null,null,null,null,null,null,"E.  PROGRAMS AND SERVICES FOR ELs AND THEIR FAMILIES (CONTINUED)",null,null,null,null,null,null,null,null,null,null,null,null,null,null,null,"E.  PROGRAMS AND SERVICES FOR ELs AND THEIR FAMILIES (CONTINUED)",null,null,null,null,null,null,null,null,null,null,null,null,null,null,null,"E.  PROGRAMS AND SERVICES FOR ELs AND THEIR FAMILIES (CONTINUED)",null,null,null,null,null,null,null,null,null,null,null,null,null,null,null,"E.  PROGRAMS AND SERVICES FOR ELs AND THEIR FAMILIES (CONTINUED)",null,null,null,null,null,null,null,null,null,null,null,null,null,null,null,"E.  PROGRAMS AND SERVICES FOR ELs AND THEIR FAMILIES (CONTINUED)",null,null,null,null,null,null,null,null,null,null,null,null,null,null,null,"E.  PROGRAMS AND SERVICES FOR ELs AND THEIR FAMILIES (CONTINUED)",null,null,null,null,null,null,null,null,null,null,null,null,null,null,null,"E.  PROGRAMS AND SERVICES FOR ELs AND THEIR FAMILIES (CONTINUED)",null,null,null,null,null,null,null,null,null,null,null,null,null,null,null,"E.  PROGRAMS AND SERVICES FOR ELs AND THEIR FAMILIES (CONTINUED)",null,null,null,null,null,null,null,null,null,null,null,null,null,null,null,"E.  PROGRAMS AND SERVICES FOR ELs AND THEIR FAMILIES (CONTINUED)",null,null,null,null,null,null,null,null,null,null,null,null,null,null,null,"E.  PROGRAMS AND SERVICES FOR ELs AND THEIR FAMILIES (CONTINUED)",null,null,null,null,null,null,null,null,null,null,null,null,null,null,null,"E.  PROGRAMS AND SERVICES FOR ELs AND THEIR FAMILIES (CONTINUED)",null,null,null,null,null,null,null,null,null,null,null,null,null,null,null,"E.  PROGRAMS AND SERVICES FOR ELs AND THEIR FAMILIES (CONTINUED)",null,null,null,null,null,null,null,null,null,null,null,null,null,null,null,"E.  PROGRAMS AND SERVICES FOR ELs AND THEIR FAMILIES (CONTINUED)",null,null,null,null,null,null,null,null,null,null,null,null,null,null,null,"E.  PROGRAMS AND SERVICES FOR ELs AND THEIR FAMILIES (CONTINUED)",null,null,null,null,null,null,null,null,null,null,null,null,null,null,null,"E.  PROGRAMS AND SERVICES FOR ELs AND THEIR FAMILIES (CONTINUED)",null,null,null,null,null,null,null,null,null,null,null,null,null,null,null,"E.  PROGRAMS AND SERVICES FOR ELs AND THEIR FAMILIES (CONTINUED)"]
["Box 6:  If applicable describe the LIEP modifications to be introduced to address specific concerns identified in the evaluation process."]
["For the 2020-2021 academic year, ACPS will continue to implement the ESOL Advisor approach that was piloted during the 2019-2020 school year. The purpose of the model is to ensure that every EL has a designated ESOL teacher with whom to connect and prevent Long-Term ELs from opting out of ESOL services. All Level 1.0-4.3 ELs meet regularly with an ESOL-certified teacher to set language proficiency goals, ensure academic success, feel empowered to obtain linguistic proficiency, and avoid languishing in the ESOL program.  Similarly, ESOL teachers monitor the academic progress of Formerly ELs and support them in collaboratively selecting and implementing their Standards of Learning (SOL) testing accommodations in the classroom.  These quarterly meetings play a key role in ensuring that Formerly ELs do not regress in their academic language acquisition.\n\n\n"]
[]
["Outreach to Limited English Proficient (LEP) Parents, Families, and Community Organizations:  The division must communicate meaningfully with LEP parents, families, and community organizations, and must notify LEP parents in a timely fashion in a language they can understand about programs, services, or activities that are made available to the general student population. "]
[]
["Box 7:  Using Local and/or State Funds:  Describe how the division provides outreach to LEP parents and families in a language they can understand to allow them the opportunity to participate in their student’s education. "]
[" Helping families and schools bridge language barriers is the first step to opening two-way communication. ACPS hosts a central school registration process at our International & ESOL Welcome Center, where we (1) guide families through the entire registration process; (2) connect them with community resources; and (3) screen students for English language proficiency with the Kindergarten W-APT and Grades 1-12 WIDA Screener, per Superintendent’s Memo #194-17. \n\nThe ACPS International & ESOL Welcome Center constantly strives to improve the quality and depth of understanding related to the required best practices in interpretation and translation services for our multilingual families. We (1) empower families to self-advocate for interpretation services, using “I Speak” cards; (2) review and update the “Interpretation and Translation Highlights” for ACPS staff; (3) formalize our ACPS-vetted interpreter and translator training; (4) intentionally connect with all schools’ Office Associates and Registrars; (5) partner with our Department of Technology to leverage technology applications that overcome language barriers; and (6) ensure that our ACPS website has the option to be translated using Google, with a visual support to make it more noticeable and accessible to EL families.\n"]
[]
["Page 23"]
[null,null,null,null,"School Division:",null,{"$f":"'Title III Budget'!$A$16","v":"ALBEMARLE COUNTY PUBLIC SCHOOLS"},null,null,null,null,null,"Division Number:",null,null,{"$f":"'Title III Budget'!$H$16","v":2}]
[]
["E.  PROGRAMS AND SERVICES FOR ELs AND THEIR FAMILIES (CONTINUED)",null,null,null,null,null,null,null,null,null,null,null,null,null,null,null,null,null,null,null,null,null,null,null,null,null,null,null,null,null,null,null,"E.  PROGRAMS AND SERVICES FOR ELs AND THEIR FAMILIES (CONTINUED)",null,null,null,null,null,null,null,null,null,null,null,null,null,null,null,"E.  PROGRAMS AND SERVICES FOR ELs AND THEIR FAMILIES (CONTINUED)",null,null,null,null,null,null,null,null,null,null,null,null,null,null,null,"E.  PROGRAMS AND SERVICES FOR ELs AND THEIR FAMILIES (CONTINUED)",null,null,null,null,null,null,null,null,null,null,null,null,null,null,null,"E.  PROGRAMS AND SERVICES FOR ELs AND THEIR FAMILIES (CONTINUED)",null,null,null,null,null,null,null,null,null,null,null,null,null,null,null,"E.  PROGRAMS AND SERVICES FOR ELs AND THEIR FAMILIES (CONTINUED)",null,null,null,null,null,null,null,null,null,null,null,null,null,null,null,"E.  PROGRAMS AND SERVICES FOR ELs AND THEIR FAMILIES (CONTINUED)",null,null,null,null,null,null,null,null,null,null,null,null,null,null,null,"E.  PROGRAMS AND SERVICES FOR ELs AND THEIR FAMILIES (CONTINUED)",null,null,null,null,null,null,null,null,null,null,null,null,null,null,null,"E.  PROGRAMS AND SERVICES FOR ELs AND THEIR FAMILIES (CONTINUED)",null,null,null,null,null,null,null,null,null,null,null,null,null,null,null,"E.  PROGRAMS AND SERVICES FOR ELs AND THEIR FAMILIES (CONTINUED)",null,null,null,null,null,null,null,null,null,null,null,null,null,null,null,"E.  PROGRAMS AND SERVICES FOR ELs AND THEIR FAMILIES (CONTINUED)",null,null,null,null,null,null,null,null,null,null,null,null,null,null,null,"E.  PROGRAMS AND SERVICES FOR ELs AND THEIR FAMILIES (CONTINUED)",null,null,null,null,null,null,null,null,null,null,null,null,null,null,null,"E.  PROGRAMS AND SERVICES FOR ELs AND THEIR FAMILIES (CONTINUED)",null,null,null,null,null,null,null,null,null,null,null,null,null,null,null,"E.  PROGRAMS AND SERVICES FOR ELs AND THEIR FAMILIES (CONTINUED)",null,null,null,null,null,null,null,null,null,null,null,null,null,null,null,"E.  PROGRAMS AND SERVICES FOR ELs AND THEIR FAMILIES (CONTINUED)",null,null,null,null,null,null,null,null,null,null,null,null,null,null,null,"E.  PROGRAMS AND SERVICES FOR ELs AND THEIR FAMILIES (CONTINUED)",null,null,null,null,null,null,null,null,null,null,null,null,null,null,null,"E.  PROGRAMS AND SERVICES FOR ELs AND THEIR FAMILIES (CONTINUED)",null,null,null,null,null,null,null,null,null,null,null,null,null,null,null,"E.  PROGRAMS AND SERVICES FOR ELs AND THEIR FAMILIES (CONTINUED)",null,null,null,null,null,null,null,null,null,null,null,null,null,null,null,"E.  PROGRAMS AND SERVICES FOR ELs AND THEIR FAMILIES (CONTINUED)",null,null,null,null,null,null,null,null,null,null,null,null,null,null,null,"E.  PROGRAMS AND SERVICES FOR ELs AND THEIR FAMILIES (CONTINUED)",null,null,null,null,null,null,null,null,null,null,null,null,null,null,null,"E.  PROGRAMS AND SERVICES FOR ELs AND THEIR FAMILIES (CONTINUED)",null,null,null,null,null,null,null,null,null,null,null,null,null,null,null,"E.  PROGRAMS AND SERVICES FOR ELs AND THEIR FAMILIES (CONTINUED)",null,null,null,null,null,null,null,null,null,null,null,null,null,null,null,"E.  PROGRAMS AND SERVICES FOR ELs AND THEIR FAMILIES (CONTINUED)",null,null,null,null,null,null,null,null,null,null,null,null,null,null,null,"E.  PROGRAMS AND SERVICES FOR ELs AND THEIR FAMILIES (CONTINUED)",null,null,null,null,null,null,null,null,null,null,null,null,null,null,null,"E.  PROGRAMS AND SERVICES FOR ELs AND THEIR FAMILIES (CONTINUED)",null,null,null,null,null,null,null,null,null,null,null,null,null,null,null,"E.  PROGRAMS AND SERVICES FOR ELs AND THEIR FAMILIES (CONTINUED)",null,null,null,null,null,null,null,null,null,null,null,null,null,null,null,"E.  PROGRAMS AND SERVICES FOR ELs AND THEIR FAMILIES (CONTINUED)",null,null,null,null,null,null,null,null,null,null,null,null,null,null,null,"E.  PROGRAMS AND SERVICES FOR ELs AND THEIR FAMILIES (CONTINUED)",null,null,null,null,null,null,null,null,null,null,null,null,null,null,null,"E.  PROGRAMS AND SERVICES FOR ELs AND THEIR FAMILIES (CONTINUED)",null,null,null,null,null,null,null,null,null,null,null,null,null,null,null,"E.  PROGRAMS AND SERVICES FOR ELs AND THEIR FAMILIES (CONTINUED)",null,null,null,null,null,null,null,null,null,null,null,null,null,null,null,"E.  PROGRAMS AND SERVICES FOR ELs AND THEIR FAMILIES (CONTINUED)",null,null,null,null,null,null,null,null,null,null,null,null,null,null,null,"E.  PROGRAMS AND SERVICES FOR ELs AND THEIR FAMILIES (CONTINUED)",null,null,null,null,null,null,null,null,null,null,null,null,null,null,null,"E.  PROGRAMS AND SERVICES FOR ELs AND THEIR FAMILIES (CONTINUED)",null,null,null,null,null,null,null,null,null,null,null,null,null,null,null,"E.  PROGRAMS AND SERVICES FOR ELs AND THEIR FAMILIES (CONTINUED)",null,null,null,null,null,null,null,null,null,null,null,null,null,null,null,"E.  PROGRAMS AND SERVICES FOR ELs AND THEIR FAMILIES (CONTINUED)",null,null,null,null,null,null,null,null,null,null,null,null,null,null,null,"E.  PROGRAMS AND SERVICES FOR ELs AND THEIR FAMILIES (CONTINUED)",null,null,null,null,null,null,null,null,null,null,null,null,null,null,null,"E.  PROGRAMS AND SERVICES FOR ELs AND THEIR FAMILIES (CONTINUED)",null,null,null,null,null,null,null,null,null,null,null,null,null,null,null,"E.  PROGRAMS AND SERVICES FOR ELs AND THEIR FAMILIES (CONTINUED)",null,null,null,null,null,null,null,null,null,null,null,null,null,null,null,"E.  PROGRAMS AND SERVICES FOR ELs AND THEIR FAMILIES (CONTINUED)",null,null,null,null,null,null,null,null,null,null,null,null,null,null,null,"E.  PROGRAMS AND SERVICES FOR ELs AND THEIR FAMILIES (CONTINUED)",null,null,null,null,null,null,null,null,null,null,null,null,null,null,null,"E.  PROGRAMS AND SERVICES FOR ELs AND THEIR FAMILIES (CONTINUED)",null,null,null,null,null,null,null,null,null,null,null,null,null,null,null,"E.  PROGRAMS AND SERVICES FOR ELs AND THEIR FAMILIES (CONTINUED)",null,null,null,null,null,null,null,null,null,null,null,null,null,null,null,"E.  PROGRAMS AND SERVICES FOR ELs AND THEIR FAMILIES (CONTINUED)",null,null,null,null,null,null,null,null,null,null,null,null,null,null,null,"E.  PROGRAMS AND SERVICES FOR ELs AND THEIR FAMILIES (CONTINUED)",null,null,null,null,null,null,null,null,null,null,null,null,null,null,null,"E.  PROGRAMS AND SERVICES FOR ELs AND THEIR FAMILIES (CONTINUED)",null,null,null,null,null,null,null,null,null,null,null,null,null,null,null,"E.  PROGRAMS AND SERVICES FOR ELs AND THEIR FAMILIES (CONTINUED)",null,null,null,null,null,null,null,null,null,null,null,null,null,null,null,"E.  PROGRAMS AND SERVICES FOR ELs AND THEIR FAMILIES (CONTINUED)",null,null,null,null,null,null,null,null,null,null,null,null,null,null,null,"E.  PROGRAMS AND SERVICES FOR ELs AND THEIR FAMILIES (CONTINUED)",null,null,null,null,null,null,null,null,null,null,null,null,null,null,null,"E.  PROGRAMS AND SERVICES FOR ELs AND THEIR FAMILIES (CONTINUED)",null,null,null,null,null,null,null,null,null,null,null,null,null,null,null,"E.  PROGRAMS AND SERVICES FOR ELs AND THEIR FAMILIES (CONTINUED)",null,null,null,null,null,null,null,null,null,null,null,null,null,null,null,"E.  PROGRAMS AND SERVICES FOR ELs AND THEIR FAMILIES (CONTINUED)",null,null,null,null,null,null,null,null,null,null,null,null,null,null,null,"E.  PROGRAMS AND SERVICES FOR ELs AND THEIR FAMILIES (CONTINUED)",null,null,null,null,null,null,null,null,null,null,null,null,null,null,null,"E.  PROGRAMS AND SERVICES FOR ELs AND THEIR FAMILIES (CONTINUED)",null,null,null,null,null,null,null,null,null,null,null,null,null,null,null,"E.  PROGRAMS AND SERVICES FOR ELs AND THEIR FAMILIES (CONTINUED)",null,null,null,null,null,null,null,null,null,null,null,null,null,null,null,"E.  PROGRAMS AND SERVICES FOR ELs AND THEIR FAMILIES (CONTINUED)",null,null,null,null,null,null,null,null,null,null,null,null,null,null,null,"E.  PROGRAMS AND SERVICES FOR ELs AND THEIR FAMILIES (CONTINUED)",null,null,null,null,null,null,null,null,null,null,null,null,null,null,null,"E.  PROGRAMS AND SERVICES FOR ELs AND THEIR FAMILIES (CONTINUED)",null,null,null,null,null,null,null,null,null,null,null,null,null,null,null,"E.  PROGRAMS AND SERVICES FOR ELs AND THEIR FAMILIES (CONTINUED)",null,null,null,null,null,null,null,null,null,null,null,null,null,null,null,"E.  PROGRAMS AND SERVICES FOR ELs AND THEIR FAMILIES (CONTINUED)",null,null,null,null,null,null,null,null,null,null,null,null,null,null,null,"E.  PROGRAMS AND SERVICES FOR ELs AND THEIR FAMILIES (CONTINUED)",null,null,null,null,null,null,null,null,null,null,null,null,null,null,null,"E.  PROGRAMS AND SERVICES FOR ELs AND THEIR FAMILIES (CONTINUED)",null,null,null,null,null,null,null,null,null,null,null,null,null,null,null,"E.  PROGRAMS AND SERVICES FOR ELs AND THEIR FAMILIES (CONTINUED)",null,null,null,null,null,null,null,null,null,null,null,null,null,null,null,"E.  PROGRAMS AND SERVICES FOR ELs AND THEIR FAMILIES (CONTINUED)",null,null,null,null,null,null,null,null,null,null,null,null,null,null,null,"E.  PROGRAMS AND SERVICES FOR ELs AND THEIR FAMILIES (CONTINUED)",null,null,null,null,null,null,null,null,null,null,null,null,null,null,null,"E.  PROGRAMS AND SERVICES FOR ELs AND THEIR FAMILIES (CONTINUED)",null,null,null,null,null,null,null,null,null,null,null,null,null,null,null,"E.  PROGRAMS AND SERVICES FOR ELs AND THEIR FAMILIES (CONTINUED)",null,null,null,null,null,null,null,null,null,null,null,null,null,null,null,"E.  PROGRAMS AND SERVICES FOR ELs AND THEIR FAMILIES (CONTINUED)",null,null,null,null,null,null,null,null,null,null,null,null,null,null,null,"E.  PROGRAMS AND SERVICES FOR ELs AND THEIR FAMILIES (CONTINUED)",null,null,null,null,null,null,null,null,null,null,null,null,null,null,null,"E.  PROGRAMS AND SERVICES FOR ELs AND THEIR FAMILIES (CONTINUED)",null,null,null,null,null,null,null,null,null,null,null,null,null,null,null,"E.  PROGRAMS AND SERVICES FOR ELs AND THEIR FAMILIES (CONTINUED)",null,null,null,null,null,null,null,null,null,null,null,null,null,null,null,"E.  PROGRAMS AND SERVICES FOR ELs AND THEIR FAMILIES (CONTINUED)",null,null,null,null,null,null,null,null,null,null,null,null,null,null,null,"E.  PROGRAMS AND SERVICES FOR ELs AND THEIR FAMILIES (CONTINUED)",null,null,null,null,null,null,null,null,null,null,null,null,null,null,null,"E.  PROGRAMS AND SERVICES FOR ELs AND THEIR FAMILIES (CONTINUED)",null,null,null,null,null,null,null,null,null,null,null,null,null,null,null,"E.  PROGRAMS AND SERVICES FOR ELs AND THEIR FAMILIES (CONTINUED)",null,null,null,null,null,null,null,null,null,null,null,null,null,null,null,"E.  PROGRAMS AND SERVICES FOR ELs AND THEIR FAMILIES (CONTINUED)",null,null,null,null,null,null,null,null,null,null,null,null,null,null,null,"E.  PROGRAMS AND SERVICES FOR ELs AND THEIR FAMILIES (CONTINUED)",null,null,null,null,null,null,null,null,null,null,null,null,null,null,null,"E.  PROGRAMS AND SERVICES FOR ELs AND THEIR FAMILIES (CONTINUED)",null,null,null,null,null,null,null,null,null,null,null,null,null,null,null,"E.  PROGRAMS AND SERVICES FOR ELs AND THEIR FAMILIES (CONTINUED)",null,null,null,null,null,null,null,null,null,null,null,null,null,null,null,"E.  PROGRAMS AND SERVICES FOR ELs AND THEIR FAMILIES (CONTINUED)",null,null,null,null,null,null,null,null,null,null,null,null,null,null,null,"E.  PROGRAMS AND SERVICES FOR ELs AND THEIR FAMILIES (CONTINUED)",null,null,null,null,null,null,null,null,null,null,null,null,null,null,null,"E.  PROGRAMS AND SERVICES FOR ELs AND THEIR FAMILIES (CONTINUED)",null,null,null,null,null,null,null,null,null,null,null,null,null,null,null,"E.  PROGRAMS AND SERVICES FOR ELs AND THEIR FAMILIES (CONTINUED)",null,null,null,null,null,null,null,null,null,null,null,null,null,null,null,"E.  PROGRAMS AND SERVICES FOR ELs AND THEIR FAMILIES (CONTINUED)",null,null,null,null,null,null,null,null,null,null,null,null,null,null,null,"E.  PROGRAMS AND SERVICES FOR ELs AND THEIR FAMILIES (CONTINUED)",null,null,null,null,null,null,null,null,null,null,null,null,null,null,null,"E.  PROGRAMS AND SERVICES FOR ELs AND THEIR FAMILIES (CONTINUED)",null,null,null,null,null,null,null,null,null,null,null,null,null,null,null,"E.  PROGRAMS AND SERVICES FOR ELs AND THEIR FAMILIES (CONTINUED)",null,null,null,null,null,null,null,null,null,null,null,null,null,null,null,"E.  PROGRAMS AND SERVICES FOR ELs AND THEIR FAMILIES (CONTINUED)",null,null,null,null,null,null,null,null,null,null,null,null,null,null,null,"E.  PROGRAMS AND SERVICES FOR ELs AND THEIR FAMILIES (CONTINUED)",null,null,null,null,null,null,null,null,null,null,null,null,null,null,null,"E.  PROGRAMS AND SERVICES FOR ELs AND THEIR FAMILIES (CONTINUED)",null,null,null,null,null,null,null,null,null,null,null,null,null,null,null,"E.  PROGRAMS AND SERVICES FOR ELs AND THEIR FAMILIES (CONTINUED)",null,null,null,null,null,null,null,null,null,null,null,null,null,null,null,"E.  PROGRAMS AND SERVICES FOR ELs AND THEIR FAMILIES (CONTINUED)",null,null,null,null,null,null,null,null,null,null,null,null,null,null,null,"E.  PROGRAMS AND SERVICES FOR ELs AND THEIR FAMILIES (CONTINUED)",null,null,null,null,null,null,null,null,null,null,null,null,null,null,null,"E.  PROGRAMS AND SERVICES FOR ELs AND THEIR FAMILIES (CONTINUED)",null,null,null,null,null,null,null,null,null,null,null,null,null,null,null,"E.  PROGRAMS AND SERVICES FOR ELs AND THEIR FAMILIES (CONTINUED)",null,null,null,null,null,null,null,null,null,null,null,null,null,null,null,"E.  PROGRAMS AND SERVICES FOR ELs AND THEIR FAMILIES (CONTINUED)",null,null,null,null,null,null,null,null,null,null,null,null,null,null,null,"E.  PROGRAMS AND SERVICES FOR ELs AND THEIR FAMILIES (CONTINUED)",null,null,null,null,null,null,null,null,null,null,null,null,null,null,null,"E.  PROGRAMS AND SERVICES FOR ELs AND THEIR FAMILIES (CONTINUED)",null,null,null,null,null,null,null,null,null,null,null,null,null,null,null,"E.  PROGRAMS AND SERVICES FOR ELs AND THEIR FAMILIES (CONTINUED)",null,null,null,null,null,null,null,null,null,null,null,null,null,null,null,"E.  PROGRAMS AND SERVICES FOR ELs AND THEIR FAMILIES (CONTINUED)",null,null,null,null,null,null,null,null,null,null,null,null,null,null,null,"E.  PROGRAMS AND SERVICES FOR ELs AND THEIR FAMILIES (CONTINUED)",null,null,null,null,null,null,null,null,null,null,null,null,null,null,null,"E.  PROGRAMS AND SERVICES FOR ELs AND THEIR FAMILIES (CONTINUED)",null,null,null,null,null,null,null,null,null,null,null,null,null,null,null,"E.  PROGRAMS AND SERVICES FOR ELs AND THEIR FAMILIES (CONTINUED)",null,null,null,null,null,null,null,null,null,null,null,null,null,null,null,"E.  PROGRAMS AND SERVICES FOR ELs AND THEIR FAMILIES (CONTINUED)",null,null,null,null,null,null,null,null,null,null,null,null,null,null,null,"E.  PROGRAMS AND SERVICES FOR ELs AND THEIR FAMILIES (CONTINUED)",null,null,null,null,null,null,null,null,null,null,null,null,null,null,null,"E.  PROGRAMS AND SERVICES FOR ELs AND THEIR FAMILIES (CONTINUED)",null,null,null,null,null,null,null,null,null,null,null,null,null,null,null,"E.  PROGRAMS AND SERVICES FOR ELs AND THEIR FAMILIES (CONTINUED)",null,null,null,null,null,null,null,null,null,null,null,null,null,null,null,"E.  PROGRAMS AND SERVICES FOR ELs AND THEIR FAMILIES (CONTINUED)",null,null,null,null,null,null,null,null,null,null,null,null,null,null,null,"E.  PROGRAMS AND SERVICES FOR ELs AND THEIR FAMILIES (CONTINUED)",null,null,null,null,null,null,null,null,null,null,null,null,null,null,null,"E.  PROGRAMS AND SERVICES FOR ELs AND THEIR FAMILIES (CONTINUED)",null,null,null,null,null,null,null,null,null,null,null,null,null,null,null,"E.  PROGRAMS AND SERVICES FOR ELs AND THEIR FAMILIES (CONTINUED)",null,null,null,null,null,null,null,null,null,null,null,null,null,null,null,"E.  PROGRAMS AND SERVICES FOR ELs AND THEIR FAMILIES (CONTINUED)",null,null,null,null,null,null,null,null,null,null,null,null,null,null,null,"E.  PROGRAMS AND SERVICES FOR ELs AND THEIR FAMILIES (CONTINUED)",null,null,null,null,null,null,null,null,null,null,null,null,null,null,null,"E.  PROGRAMS AND SERVICES FOR ELs AND THEIR FAMILIES (CONTINUED)",null,null,null,null,null,null,null,null,null,null,null,null,null,null,null,"E.  PROGRAMS AND SERVICES FOR ELs AND THEIR FAMILIES (CONTINUED)",null,null,null,null,null,null,null,null,null,null,null,null,null,null,null,"E.  PROGRAMS AND SERVICES FOR ELs AND THEIR FAMILIES (CONTINUED)",null,null,null,null,null,null,null,null,null,null,null,null,null,null,null,"E.  PROGRAMS AND SERVICES FOR ELs AND THEIR FAMILIES (CONTINUED)",null,null,null,null,null,null,null,null,null,null,null,null,null,null,null,"E.  PROGRAMS AND SERVICES FOR ELs AND THEIR FAMILIES (CONTINUED)",null,null,null,null,null,null,null,null,null,null,null,null,null,null,null,"E.  PROGRAMS AND SERVICES FOR ELs AND THEIR FAMILIES (CONTINUED)",null,null,null,null,null,null,null,null,null,null,null,null,null,null,null,"E.  PROGRAMS AND SERVICES FOR ELs AND THEIR FAMILIES (CONTINUED)",null,null,null,null,null,null,null,null,null,null,null,null,null,null,null,"E.  PROGRAMS AND SERVICES FOR ELs AND THEIR FAMILIES (CONTINUED)",null,null,null,null,null,null,null,null,null,null,null,null,null,null,null,"E.  PROGRAMS AND SERVICES FOR ELs AND THEIR FAMILIES (CONTINUED)",null,null,null,null,null,null,null,null,null,null,null,null,null,null,null,"E.  PROGRAMS AND SERVICES FOR ELs AND THEIR FAMILIES (CONTINUED)",null,null,null,null,null,null,null,null,null,null,null,null,null,null,null,"E.  PROGRAMS AND SERVICES FOR ELs AND THEIR FAMILIES (CONTINUED)",null,null,null,null,null,null,null,null,null,null,null,null,null,null,null,"E.  PROGRAMS AND SERVICES FOR ELs AND THEIR FAMILIES (CONTINUED)",null,null,null,null,null,null,null,null,null,null,null,null,null,null,null,"E.  PROGRAMS AND SERVICES FOR ELs AND THEIR FAMILIES (CONTINUED)",null,null,null,null,null,null,null,null,null,null,null,null,null,null,null,"E.  PROGRAMS AND SERVICES FOR ELs AND THEIR FAMILIES (CONTINUED)",null,null,null,null,null,null,null,null,null,null,null,null,null,null,null,"E.  PROGRAMS AND SERVICES FOR ELs AND THEIR FAMILIES (CONTINUED)",null,null,null,null,null,null,null,null,null,null,null,null,null,null,null,"E.  PROGRAMS AND SERVICES FOR ELs AND THEIR FAMILIES (CONTINUED)",null,null,null,null,null,null,null,null,null,null,null,null,null,null,null,"E.  PROGRAMS AND SERVICES FOR ELs AND THEIR FAMILIES (CONTINUED)",null,null,null,null,null,null,null,null,null,null,null,null,null,null,null,"E.  PROGRAMS AND SERVICES FOR ELs AND THEIR FAMILIES (CONTINUED)",null,null,null,null,null,null,null,null,null,null,null,null,null,null,null,"E.  PROGRAMS AND SERVICES FOR ELs AND THEIR FAMILIES (CONTINUED)",null,null,null,null,null,null,null,null,null,null,null,null,null,null,null,"E.  PROGRAMS AND SERVICES FOR ELs AND THEIR FAMILIES (CONTINUED)",null,null,null,null,null,null,null,null,null,null,null,null,null,null,null,"E.  PROGRAMS AND SERVICES FOR ELs AND THEIR FAMILIES (CONTINUED)",null,null,null,null,null,null,null,null,null,null,null,null,null,null,null,"E.  PROGRAMS AND SERVICES FOR ELs AND THEIR FAMILIES (CONTINUED)",null,null,null,null,null,null,null,null,null,null,null,null,null,null,null,"E.  PROGRAMS AND SERVICES FOR ELs AND THEIR FAMILIES (CONTINUED)",null,null,null,null,null,null,null,null,null,null,null,null,null,null,null,"E.  PROGRAMS AND SERVICES FOR ELs AND THEIR FAMILIES (CONTINUED)",null,null,null,null,null,null,null,null,null,null,null,null,null,null,null,"E.  PROGRAMS AND SERVICES FOR ELs AND THEIR FAMILIES (CONTINUED)",null,null,null,null,null,null,null,null,null,null,null,null,null,null,null,"E.  PROGRAMS AND SERVICES FOR ELs AND THEIR FAMILIES (CONTINUED)",null,null,null,null,null,null,null,null,null,null,null,null,null,null,null,"E.  PROGRAMS AND SERVICES FOR ELs AND THEIR FAMILIES (CONTINUED)",null,null,null,null,null,null,null,null,null,null,null,null,null,null,null,"E.  PROGRAMS AND SERVICES FOR ELs AND THEIR FAMILIES (CONTINUED)",null,null,null,null,null,null,null,null,null,null,null,null,null,null,null,"E.  PROGRAMS AND SERVICES FOR ELs AND THEIR FAMILIES (CONTINUED)",null,null,null,null,null,null,null,null,null,null,null,null,null,null,null,"E.  PROGRAMS AND SERVICES FOR ELs AND THEIR FAMILIES (CONTINUED)",null,null,null,null,null,null,null,null,null,null,null,null,null,null,null,"E.  PROGRAMS AND SERVICES FOR ELs AND THEIR FAMILIES (CONTINUED)",null,null,null,null,null,null,null,null,null,null,null,null,null,null,null,"E.  PROGRAMS AND SERVICES FOR ELs AND THEIR FAMILIES (CONTINUED)",null,null,null,null,null,null,null,null,null,null,null,null,null,null,null,"E.  PROGRAMS AND SERVICES FOR ELs AND THEIR FAMILIES (CONTINUED)",null,null,null,null,null,null,null,null,null,null,null,null,null,null,null,"E.  PROGRAMS AND SERVICES FOR ELs AND THEIR FAMILIES (CONTINUED)",null,null,null,null,null,null,null,null,null,null,null,null,null,null,null,"E.  PROGRAMS AND SERVICES FOR ELs AND THEIR FAMILIES (CONTINUED)",null,null,null,null,null,null,null,null,null,null,null,null,null,null,null,"E.  PROGRAMS AND SERVICES FOR ELs AND THEIR FAMILIES (CONTINUED)",null,null,null,null,null,null,null,null,null,null,null,null,null,null,null,"E.  PROGRAMS AND SERVICES FOR ELs AND THEIR FAMILIES (CONTINUED)",null,null,null,null,null,null,null,null,null,null,null,null,null,null,null,"E.  PROGRAMS AND SERVICES FOR ELs AND THEIR FAMILIES (CONTINUED)",null,null,null,null,null,null,null,null,null,null,null,null,null,null,null,"E.  PROGRAMS AND SERVICES FOR ELs AND THEIR FAMILIES (CONTINUED)",null,null,null,null,null,null,null,null,null,null,null,null,null,null,null,"E.  PROGRAMS AND SERVICES FOR ELs AND THEIR FAMILIES (CONTINUED)",null,null,null,null,null,null,null,null,null,null,null,null,null,null,null,"E.  PROGRAMS AND SERVICES FOR ELs AND THEIR FAMILIES (CONTINUED)",null,null,null,null,null,null,null,null,null,null,null,null,null,null,null,"E.  PROGRAMS AND SERVICES FOR ELs AND THEIR FAMILIES (CONTINUED)",null,null,null,null,null,null,null,null,null,null,null,null,null,null,null,"E.  PROGRAMS AND SERVICES FOR ELs AND THEIR FAMILIES (CONTINUED)",null,null,null,null,null,null,null,null,null,null,null,null,null,null,null,"E.  PROGRAMS AND SERVICES FOR ELs AND THEIR FAMILIES (CONTINUED)",null,null,null,null,null,null,null,null,null,null,null,null,null,null,null,"E.  PROGRAMS AND SERVICES FOR ELs AND THEIR FAMILIES (CONTINUED)",null,null,null,null,null,null,null,null,null,null,null,null,null,null,null,"E.  PROGRAMS AND SERVICES FOR ELs AND THEIR FAMILIES (CONTINUED)",null,null,null,null,null,null,null,null,null,null,null,null,null,null,null,"E.  PROGRAMS AND SERVICES FOR ELs AND THEIR FAMILIES (CONTINUED)",null,null,null,null,null,null,null,null,null,null,null,null,null,null,null,"E.  PROGRAMS AND SERVICES FOR ELs AND THEIR FAMILIES (CONTINUED)",null,null,null,null,null,null,null,null,null,null,null,null,null,null,null,"E.  PROGRAMS AND SERVICES FOR ELs AND THEIR FAMILIES (CONTINUED)",null,null,null,null,null,null,null,null,null,null,null,null,null,null,null,"E.  PROGRAMS AND SERVICES FOR ELs AND THEIR FAMILIES (CONTINUED)",null,null,null,null,null,null,null,null,null,null,null,null,null,null,null,"E.  PROGRAMS AND SERVICES FOR ELs AND THEIR FAMILIES (CONTINUED)",null,null,null,null,null,null,null,null,null,null,null,null,null,null,null,"E.  PROGRAMS AND SERVICES FOR ELs AND THEIR FAMILIES (CONTINUED)",null,null,null,null,null,null,null,null,null,null,null,null,null,null,null,"E.  PROGRAMS AND SERVICES FOR ELs AND THEIR FAMILIES (CONTINUED)",null,null,null,null,null,null,null,null,null,null,null,null,null,null,null,"E.  PROGRAMS AND SERVICES FOR ELs AND THEIR FAMILIES (CONTINUED)",null,null,null,null,null,null,null,null,null,null,null,null,null,null,null,"E.  PROGRAMS AND SERVICES FOR ELs AND THEIR FAMILIES (CONTINUED)",null,null,null,null,null,null,null,null,null,null,null,null,null,null,null,"E.  PROGRAMS AND SERVICES FOR ELs AND THEIR FAMILIES (CONTINUED)",null,null,null,null,null,null,null,null,null,null,null,null,null,null,null,"E.  PROGRAMS AND SERVICES FOR ELs AND THEIR FAMILIES (CONTINUED)",null,null,null,null,null,null,null,null,null,null,null,null,null,null,null,"E.  PROGRAMS AND SERVICES FOR ELs AND THEIR FAMILIES (CONTINUED)",null,null,null,null,null,null,null,null,null,null,null,null,null,null,null,"E.  PROGRAMS AND SERVICES FOR ELs AND THEIR FAMILIES (CONTINUED)",null,null,null,null,null,null,null,null,null,null,null,null,null,null,null,"E.  PROGRAMS AND SERVICES FOR ELs AND THEIR FAMILIES (CONTINUED)",null,null,null,null,null,null,null,null,null,null,null,null,null,null,null,"E.  PROGRAMS AND SERVICES FOR ELs AND THEIR FAMILIES (CONTINUED)",null,null,null,null,null,null,null,null,null,null,null,null,null,null,null,"E.  PROGRAMS AND SERVICES FOR ELs AND THEIR FAMILIES (CONTINUED)",null,null,null,null,null,null,null,null,null,null,null,null,null,null,null,"E.  PROGRAMS AND SERVICES FOR ELs AND THEIR FAMILIES (CONTINUED)",null,null,null,null,null,null,null,null,null,null,null,null,null,null,null,"E.  PROGRAMS AND SERVICES FOR ELs AND THEIR FAMILIES (CONTINUED)",null,null,null,null,null,null,null,null,null,null,null,null,null,null,null,"E.  PROGRAMS AND SERVICES FOR ELs AND THEIR FAMILIES (CONTINUED)",null,null,null,null,null,null,null,null,null,null,null,null,null,null,null,"E.  PROGRAMS AND SERVICES FOR ELs AND THEIR FAMILIES (CONTINUED)",null,null,null,null,null,null,null,null,null,null,null,null,null,null,null,"E.  PROGRAMS AND SERVICES FOR ELs AND THEIR FAMILIES (CONTINUED)",null,null,null,null,null,null,null,null,null,null,null,null,null,null,null,"E.  PROGRAMS AND SERVICES FOR ELs AND THEIR FAMILIES (CONTINUED)",null,null,null,null,null,null,null,null,null,null,null,null,null,null,null,"E.  PROGRAMS AND SERVICES FOR ELs AND THEIR FAMILIES (CONTINUED)",null,null,null,null,null,null,null,null,null,null,null,null,null,null,null,"E.  PROGRAMS AND SERVICES FOR ELs AND THEIR FAMILIES (CONTINUED)",null,null,null,null,null,null,null,null,null,null,null,null,null,null,null,"E.  PROGRAMS AND SERVICES FOR ELs AND THEIR FAMILIES (CONTINUED)",null,null,null,null,null,null,null,null,null,null,null,null,null,null,null,"E.  PROGRAMS AND SERVICES FOR ELs AND THEIR FAMILIES (CONTINUED)",null,null,null,null,null,null,null,null,null,null,null,null,null,null,null,"E.  PROGRAMS AND SERVICES FOR ELs AND THEIR FAMILIES (CONTINUED)",null,null,null,null,null,null,null,null,null,null,null,null,null,null,null,"E.  PROGRAMS AND SERVICES FOR ELs AND THEIR FAMILIES (CONTINUED)",null,null,null,null,null,null,null,null,null,null,null,null,null,null,null,"E.  PROGRAMS AND SERVICES FOR ELs AND THEIR FAMILIES (CONTINUED)",null,null,null,null,null,null,null,null,null,null,null,null,null,null,null,"E.  PROGRAMS AND SERVICES FOR ELs AND THEIR FAMILIES (CONTINUED)",null,null,null,null,null,null,null,null,null,null,null,null,null,null,null,"E.  PROGRAMS AND SERVICES FOR ELs AND THEIR FAMILIES (CONTINUED)",null,null,null,null,null,null,null,null,null,null,null,null,null,null,null,"E.  PROGRAMS AND SERVICES FOR ELs AND THEIR FAMILIES (CONTINUED)",null,null,null,null,null,null,null,null,null,null,null,null,null,null,null,"E.  PROGRAMS AND SERVICES FOR ELs AND THEIR FAMILIES (CONTINUED)",null,null,null,null,null,null,null,null,null,null,null,null,null,null,null,"E.  PROGRAMS AND SERVICES FOR ELs AND THEIR FAMILIES (CONTINUED)",null,null,null,null,null,null,null,null,null,null,null,null,null,null,null,"E.  PROGRAMS AND SERVICES FOR ELs AND THEIR FAMILIES (CONTINUED)",null,null,null,null,null,null,null,null,null,null,null,null,null,null,null,"E.  PROGRAMS AND SERVICES FOR ELs AND THEIR FAMILIES (CONTINUED)",null,null,null,null,null,null,null,null,null,null,null,null,null,null,null,"E.  PROGRAMS AND SERVICES FOR ELs AND THEIR FAMILIES (CONTINUED)",null,null,null,null,null,null,null,null,null,null,null,null,null,null,null,"E.  PROGRAMS AND SERVICES FOR ELs AND THEIR FAMILIES (CONTINUED)",null,null,null,null,null,null,null,null,null,null,null,null,null,null,null,"E.  PROGRAMS AND SERVICES FOR ELs AND THEIR FAMILIES (CONTINUED)",null,null,null,null,null,null,null,null,null,null,null,null,null,null,null,"E.  PROGRAMS AND SERVICES FOR ELs AND THEIR FAMILIES (CONTINUED)",null,null,null,null,null,null,null,null,null,null,null,null,null,null,null,"E.  PROGRAMS AND SERVICES FOR ELs AND THEIR FAMILIES (CONTINUED)",null,null,null,null,null,null,null,null,null,null,null,null,null,null,null,"E.  PROGRAMS AND SERVICES FOR ELs AND THEIR FAMILIES (CONTINUED)",null,null,null,null,null,null,null,null,null,null,null,null,null,null,null,"E.  PROGRAMS AND SERVICES FOR ELs AND THEIR FAMILIES (CONTINUED)",null,null,null,null,null,null,null,null,null,null,null,null,null,null,null,"E.  PROGRAMS AND SERVICES FOR ELs AND THEIR FAMILIES (CONTINUED)",null,null,null,null,null,null,null,null,null,null,null,null,null,null,null,"E.  PROGRAMS AND SERVICES FOR ELs AND THEIR FAMILIES (CONTINUED)",null,null,null,null,null,null,null,null,null,null,null,null,null,null,null,"E.  PROGRAMS AND SERVICES FOR ELs AND THEIR FAMILIES (CONTINUED)",null,null,null,null,null,null,null,null,null,null,null,null,null,null,null,"E.  PROGRAMS AND SERVICES FOR ELs AND THEIR FAMILIES (CONTINUED)",null,null,null,null,null,null,null,null,null,null,null,null,null,null,null,"E.  PROGRAMS AND SERVICES FOR ELs AND THEIR FAMILIES (CONTINUED)",null,null,null,null,null,null,null,null,null,null,null,null,null,null,null,"E.  PROGRAMS AND SERVICES FOR ELs AND THEIR FAMILIES (CONTINUED)",null,null,null,null,null,null,null,null,null,null,null,null,null,null,null,"E.  PROGRAMS AND SERVICES FOR ELs AND THEIR FAMILIES (CONTINUED)",null,null,null,null,null,null,null,null,null,null,null,null,null,null,null,"E.  PROGRAMS AND SERVICES FOR ELs AND THEIR FAMILIES (CONTINUED)",null,null,null,null,null,null,null,null,null,null,null,null,null,null,null,"E.  PROGRAMS AND SERVICES FOR ELs AND THEIR FAMILIES (CONTINUED)",null,null,null,null,null,null,null,null,null,null,null,null,null,null,null,"E.  PROGRAMS AND SERVICES FOR ELs AND THEIR FAMILIES (CONTINUED)",null,null,null,null,null,null,null,null,null,null,null,null,null,null,null,"E.  PROGRAMS AND SERVICES FOR ELs AND THEIR FAMILIES (CONTINUED)",null,null,null,null,null,null,null,null,null,null,null,null,null,null,null,"E.  PROGRAMS AND SERVICES FOR ELs AND THEIR FAMILIES (CONTINUED)",null,null,null,null,null,null,null,null,null,null,null,null,null,null,null,"E.  PROGRAMS AND SERVICES FOR ELs AND THEIR FAMILIES (CONTINUED)",null,null,null,null,null,null,null,null,null,null,null,null,null,null,null,"E.  PROGRAMS AND SERVICES FOR ELs AND THEIR FAMILIES (CONTINUED)",null,null,null,null,null,null,null,null,null,null,null,null,null,null,null,"E.  PROGRAMS AND SERVICES FOR ELs AND THEIR FAMILIES (CONTINUED)",null,null,null,null,null,null,null,null,null,null,null,null,null,null,null,"E.  PROGRAMS AND SERVICES FOR ELs AND THEIR FAMILIES (CONTINUED)",null,null,null,null,null,null,null,null,null,null,null,null,null,null,null,"E.  PROGRAMS AND SERVICES FOR ELs AND THEIR FAMILIES (CONTINUED)",null,null,null,null,null,null,null,null,null,null,null,null,null,null,null,"E.  PROGRAMS AND SERVICES FOR ELs AND THEIR FAMILIES (CONTINUED)",null,null,null,null,null,null,null,null,null,null,null,null,null,null,null,"E.  PROGRAMS AND SERVICES FOR ELs AND THEIR FAMILIES (CONTINUED)",null,null,null,null,null,null,null,null,null,null,null,null,null,null,null,"E.  PROGRAMS AND SERVICES FOR ELs AND THEIR FAMILIES (CONTINUED)",null,null,null,null,null,null,null,null,null,null,null,null,null,null,null,"E.  PROGRAMS AND SERVICES FOR ELs AND THEIR FAMILIES (CONTINUED)",null,null,null,null,null,null,null,null,null,null,null,null,null,null,null,"E.  PROGRAMS AND SERVICES FOR ELs AND THEIR FAMILIES (CONTINUED)",null,null,null,null,null,null,null,null,null,null,null,null,null,null,null,"E.  PROGRAMS AND SERVICES FOR ELs AND THEIR FAMILIES (CONTINUED)",null,null,null,null,null,null,null,null,null,null,null,null,null,null,null,"E.  PROGRAMS AND SERVICES FOR ELs AND THEIR FAMILIES (CONTINUED)",null,null,null,null,null,null,null,null,null,null,null,null,null,null,null,"E.  PROGRAMS AND SERVICES FOR ELs AND THEIR FAMILIES (CONTINUED)",null,null,null,null,null,null,null,null,null,null,null,null,null,null,null,"E.  PROGRAMS AND SERVICES FOR ELs AND THEIR FAMILIES (CONTINUED)",null,null,null,null,null,null,null,null,null,null,null,null,null,null,null,"E.  PROGRAMS AND SERVICES FOR ELs AND THEIR FAMILIES (CONTINUED)",null,null,null,null,null,null,null,null,null,null,null,null,null,null,null,"E.  PROGRAMS AND SERVICES FOR ELs AND THEIR FAMILIES (CONTINUED)",null,null,null,null,null,null,null,null,null,null,null,null,null,null,null,"E.  PROGRAMS AND SERVICES FOR ELs AND THEIR FAMILIES (CONTINUED)",null,null,null,null,null,null,null,null,null,null,null,null,null,null,null,"E.  PROGRAMS AND SERVICES FOR ELs AND THEIR FAMILIES (CONTINUED)",null,null,null,null,null,null,null,null,null,null,null,null,null,null,null,"E.  PROGRAMS AND SERVICES FOR ELs AND THEIR FAMILIES (CONTINUED)",null,null,null,null,null,null,null,null,null,null,null,null,null,null,null,"E.  PROGRAMS AND SERVICES FOR ELs AND THEIR FAMILIES (CONTINUED)",null,null,null,null,null,null,null,null,null,null,null,null,null,null,null,"E.  PROGRAMS AND SERVICES FOR ELs AND THEIR FAMILIES (CONTINUED)",null,null,null,null,null,null,null,null,null,null,null,null,null,null,null,"E.  PROGRAMS AND SERVICES FOR ELs AND THEIR FAMILIES (CONTINUED)",null,null,null,null,null,null,null,null,null,null,null,null,null,null,null,"E.  PROGRAMS AND SERVICES FOR ELs AND THEIR FAMILIES (CONTINUED)",null,null,null,null,null,null,null,null,null,null,null,null,null,null,null,"E.  PROGRAMS AND SERVICES FOR ELs AND THEIR FAMILIES (CONTINUED)",null,null,null,null,null,null,null,null,null,null,null,null,null,null,null,"E.  PROGRAMS AND SERVICES FOR ELs AND THEIR FAMILIES (CONTINUED)",null,null,null,null,null,null,null,null,null,null,null,null,null,null,null,"E.  PROGRAMS AND SERVICES FOR ELs AND THEIR FAMILIES (CONTINUED)",null,null,null,null,null,null,null,null,null,null,null,null,null,null,null,"E.  PROGRAMS AND SERVICES FOR ELs AND THEIR FAMILIES (CONTINUED)",null,null,null,null,null,null,null,null,null,null,null,null,null,null,null,"E.  PROGRAMS AND SERVICES FOR ELs AND THEIR FAMILIES (CONTINUED)",null,null,null,null,null,null,null,null,null,null,null,null,null,null,null,"E.  PROGRAMS AND SERVICES FOR ELs AND THEIR FAMILIES (CONTINUED)",null,null,null,null,null,null,null,null,null,null,null,null,null,null,null,"E.  PROGRAMS AND SERVICES FOR ELs AND THEIR FAMILIES (CONTINUED)",null,null,null,null,null,null,null,null,null,null,null,null,null,null,null,"E.  PROGRAMS AND SERVICES FOR ELs AND THEIR FAMILIES (CONTINUED)",null,null,null,null,null,null,null,null,null,null,null,null,null,null,null,"E.  PROGRAMS AND SERVICES FOR ELs AND THEIR FAMILIES (CONTINUED)",null,null,null,null,null,null,null,null,null,null,null,null,null,null,null,"E.  PROGRAMS AND SERVICES FOR ELs AND THEIR FAMILIES (CONTINUED)",null,null,null,null,null,null,null,null,null,null,null,null,null,null,null,"E.  PROGRAMS AND SERVICES FOR ELs AND THEIR FAMILIES (CONTINUED)",null,null,null,null,null,null,null,null,null,null,null,null,null,null,null,"E.  PROGRAMS AND SERVICES FOR ELs AND THEIR FAMILIES (CONTINUED)",null,null,null,null,null,null,null,null,null,null,null,null,null,null,null,"E.  PROGRAMS AND SERVICES FOR ELs AND THEIR FAMILIES (CONTINUED)",null,null,null,null,null,null,null,null,null,null,null,null,null,null,null,"E.  PROGRAMS AND SERVICES FOR ELs AND THEIR FAMILIES (CONTINUED)",null,null,null,null,null,null,null,null,null,null,null,null,null,null,null,"E.  PROGRAMS AND SERVICES FOR ELs AND THEIR FAMILIES (CONTINUED)",null,null,null,null,null,null,null,null,null,null,null,null,null,null,null,"E.  PROGRAMS AND SERVICES FOR ELs AND THEIR FAMILIES (CONTINUED)",null,null,null,null,null,null,null,null,null,null,null,null,null,null,null,"E.  PROGRAMS AND SERVICES FOR ELs AND THEIR FAMILIES (CONTINUED)",null,null,null,null,null,null,null,null,null,null,null,null,null,null,null,"E.  PROGRAMS AND SERVICES FOR ELs AND THEIR FAMILIES (CONTINUED)",null,null,null,null,null,null,null,null,null,null,null,null,null,null,null,"E.  PROGRAMS AND SERVICES FOR ELs AND THEIR FAMILIES (CONTINUED)",null,null,null,null,null,null,null,null,null,null,null,null,null,null,null,"E.  PROGRAMS AND SERVICES FOR ELs AND THEIR FAMILIES (CONTINUED)",null,null,null,null,null,null,null,null,null,null,null,null,null,null,null,"E.  PROGRAMS AND SERVICES FOR ELs AND THEIR FAMILIES (CONTINUED)",null,null,null,null,null,null,null,null,null,null,null,null,null,null,null,"E.  PROGRAMS AND SERVICES FOR ELs AND THEIR FAMILIES (CONTINUED)",null,null,null,null,null,null,null,null,null,null,null,null,null,null,null,"E.  PROGRAMS AND SERVICES FOR ELs AND THEIR FAMILIES (CONTINUED)",null,null,null,null,null,null,null,null,null,null,null,null,null,null,null,"E.  PROGRAMS AND SERVICES FOR ELs AND THEIR FAMILIES (CONTINUED)",null,null,null,null,null,null,null,null,null,null,null,null,null,null,null,"E.  PROGRAMS AND SERVICES FOR ELs AND THEIR FAMILIES (CONTINUED)",null,null,null,null,null,null,null,null,null,null,null,null,null,null,null,"E.  PROGRAMS AND SERVICES FOR ELs AND THEIR FAMILIES (CONTINUED)",null,null,null,null,null,null,null,null,null,null,null,null,null,null,null,"E.  PROGRAMS AND SERVICES FOR ELs AND THEIR FAMILIES (CONTINUED)",null,null,null,null,null,null,null,null,null,null,null,null,null,null,null,"E.  PROGRAMS AND SERVICES FOR ELs AND THEIR FAMILIES (CONTINUED)",null,null,null,null,null,null,null,null,null,null,null,null,null,null,null,"E.  PROGRAMS AND SERVICES FOR ELs AND THEIR FAMILIES (CONTINUED)",null,null,null,null,null,null,null,null,null,null,null,null,null,null,null,"E.  PROGRAMS AND SERVICES FOR ELs AND THEIR FAMILIES (CONTINUED)",null,null,null,null,null,null,null,null,null,null,null,null,null,null,null,"E.  PROGRAMS AND SERVICES FOR ELs AND THEIR FAMILIES (CONTINUED)",null,null,null,null,null,null,null,null,null,null,null,null,null,null,null,"E.  PROGRAMS AND SERVICES FOR ELs AND THEIR FAMILIES (CONTINUED)",null,null,null,null,null,null,null,null,null,null,null,null,null,null,null,"E.  PROGRAMS AND SERVICES FOR ELs AND THEIR FAMILIES (CONTINUED)",null,null,null,null,null,null,null,null,null,null,null,null,null,null,null,"E.  PROGRAMS AND SERVICES FOR ELs AND THEIR FAMILIES (CONTINUED)",null,null,null,null,null,null,null,null,null,null,null,null,null,null,null,"E.  PROGRAMS AND SERVICES FOR ELs AND THEIR FAMILIES (CONTINUED)",null,null,null,null,null,null,null,null,null,null,null,null,null,null,null,"E.  PROGRAMS AND SERVICES FOR ELs AND THEIR FAMILIES (CONTINUED)",null,null,null,null,null,null,null,null,null,null,null,null,null,null,null,"E.  PROGRAMS AND SERVICES FOR ELs AND THEIR FAMILIES (CONTINUED)",null,null,null,null,null,null,null,null,null,null,null,null,null,null,null,"E.  PROGRAMS AND SERVICES FOR ELs AND THEIR FAMILIES (CONTINUED)",null,null,null,null,null,null,null,null,null,null,null,null,null,null,null,"E.  PROGRAMS AND SERVICES FOR ELs AND THEIR FAMILIES (CONTINUED)",null,null,null,null,null,null,null,null,null,null,null,null,null,null,null,"E.  PROGRAMS AND SERVICES FOR ELs AND THEIR FAMILIES (CONTINUED)",null,null,null,null,null,null,null,null,null,null,null,null,null,null,null,"E.  PROGRAMS AND SERVICES FOR ELs AND THEIR FAMILIES (CONTINUED)",null,null,null,null,null,null,null,null,null,null,null,null,null,null,null,"E.  PROGRAMS AND SERVICES FOR ELs AND THEIR FAMILIES (CONTINUED)",null,null,null,null,null,null,null,null,null,null,null,null,null,null,null,"E.  PROGRAMS AND SERVICES FOR ELs AND THEIR FAMILIES (CONTINUED)",null,null,null,null,null,null,null,null,null,null,null,null,null,null,null,"E.  PROGRAMS AND SERVICES FOR ELs AND THEIR FAMILIES (CONTINUED)",null,null,null,null,null,null,null,null,null,null,null,null,null,null,null,"E.  PROGRAMS AND SERVICES FOR ELs AND THEIR FAMILIES (CONTINUED)",null,null,null,null,null,null,null,null,null,null,null,null,null,null,null,"E.  PROGRAMS AND SERVICES FOR ELs AND THEIR FAMILIES (CONTINUED)",null,null,null,null,null,null,null,null,null,null,null,null,null,null,null,"E.  PROGRAMS AND SERVICES FOR ELs AND THEIR FAMILIES (CONTINUED)",null,null,null,null,null,null,null,null,null,null,null,null,null,null,null,"E.  PROGRAMS AND SERVICES FOR ELs AND THEIR FAMILIES (CONTINUED)",null,null,null,null,null,null,null,null,null,null,null,null,null,null,null,"E.  PROGRAMS AND SERVICES FOR ELs AND THEIR FAMILIES (CONTINUED)",null,null,null,null,null,null,null,null,null,null,null,null,null,null,null,"E.  PROGRAMS AND SERVICES FOR ELs AND THEIR FAMILIES (CONTINUED)",null,null,null,null,null,null,null,null,null,null,null,null,null,null,null,"E.  PROGRAMS AND SERVICES FOR ELs AND THEIR FAMILIES (CONTINUED)",null,null,null,null,null,null,null,null,null,null,null,null,null,null,null,"E.  PROGRAMS AND SERVICES FOR ELs AND THEIR FAMILIES (CONTINUED)",null,null,null,null,null,null,null,null,null,null,null,null,null,null,null,"E.  PROGRAMS AND SERVICES FOR ELs AND THEIR FAMILIES (CONTINUED)",null,null,null,null,null,null,null,null,null,null,null,null,null,null,null,"E.  PROGRAMS AND SERVICES FOR ELs AND THEIR FAMILIES (CONTINUED)",null,null,null,null,null,null,null,null,null,null,null,null,null,null,null,"E.  PROGRAMS AND SERVICES FOR ELs AND THEIR FAMILIES (CONTINUED)",null,null,null,null,null,null,null,null,null,null,null,null,null,null,null,"E.  PROGRAMS AND SERVICES FOR ELs AND THEIR FAMILIES (CONTINUED)",null,null,null,null,null,null,null,null,null,null,null,null,null,null,null,"E.  PROGRAMS AND SERVICES FOR ELs AND THEIR FAMILIES (CONTINUED)",null,null,null,null,null,null,null,null,null,null,null,null,null,null,null,"E.  PROGRAMS AND SERVICES FOR ELs AND THEIR FAMILIES (CONTINUED)",null,null,null,null,null,null,null,null,null,null,null,null,null,null,null,"E.  PROGRAMS AND SERVICES FOR ELs AND THEIR FAMILIES (CONTINUED)",null,null,null,null,null,null,null,null,null,null,null,null,null,null,null,"E.  PROGRAMS AND SERVICES FOR ELs AND THEIR FAMILIES (CONTINUED)",null,null,null,null,null,null,null,null,null,null,null,null,null,null,null,"E.  PROGRAMS AND SERVICES FOR ELs AND THEIR FAMILIES (CONTINUED)",null,null,null,null,null,null,null,null,null,null,null,null,null,null,null,"E.  PROGRAMS AND SERVICES FOR ELs AND THEIR FAMILIES (CONTINUED)",null,null,null,null,null,null,null,null,null,null,null,null,null,null,null,"E.  PROGRAMS AND SERVICES FOR ELs AND THEIR FAMILIES (CONTINUED)",null,null,null,null,null,null,null,null,null,null,null,null,null,null,null,"E.  PROGRAMS AND SERVICES FOR ELs AND THEIR FAMILIES (CONTINUED)",null,null,null,null,null,null,null,null,null,null,null,null,null,null,null,"E.  PROGRAMS AND SERVICES FOR ELs AND THEIR FAMILIES (CONTINUED)",null,null,null,null,null,null,null,null,null,null,null,null,null,null,null,"E.  PROGRAMS AND SERVICES FOR ELs AND THEIR FAMILIES (CONTINUED)",null,null,null,null,null,null,null,null,null,null,null,null,null,null,null,"E.  PROGRAMS AND SERVICES FOR ELs AND THEIR FAMILIES (CONTINUED)",null,null,null,null,null,null,null,null,null,null,null,null,null,null,null,"E.  PROGRAMS AND SERVICES FOR ELs AND THEIR FAMILIES (CONTINUED)",null,null,null,null,null,null,null,null,null,null,null,null,null,null,null,"E.  PROGRAMS AND SERVICES FOR ELs AND THEIR FAMILIES (CONTINUED)",null,null,null,null,null,null,null,null,null,null,null,null,null,null,null,"E.  PROGRAMS AND SERVICES FOR ELs AND THEIR FAMILIES (CONTINUED)",null,null,null,null,null,null,null,null,null,null,null,null,null,null,null,"E.  PROGRAMS AND SERVICES FOR ELs AND THEIR FAMILIES (CONTINUED)",null,null,null,null,null,null,null,null,null,null,null,null,null,null,null,"E.  PROGRAMS AND SERVICES FOR ELs AND THEIR FAMILIES (CONTINUED)",null,null,null,null,null,null,null,null,null,null,null,null,null,null,null,"E.  PROGRAMS AND SERVICES FOR ELs AND THEIR FAMILIES (CONTINUED)",null,null,null,null,null,null,null,null,null,null,null,null,null,null,null,"E.  PROGRAMS AND SERVICES FOR ELs AND THEIR FAMILIES (CONTINUED)",null,null,null,null,null,null,null,null,null,null,null,null,null,null,null,"E.  PROGRAMS AND SERVICES FOR ELs AND THEIR FAMILIES (CONTINUED)",null,null,null,null,null,null,null,null,null,null,null,null,null,null,null,"E.  PROGRAMS AND SERVICES FOR ELs AND THEIR FAMILIES (CONTINUED)",null,null,null,null,null,null,null,null,null,null,null,null,null,null,null,"E.  PROGRAMS AND SERVICES FOR ELs AND THEIR FAMILIES (CONTINUED)",null,null,null,null,null,null,null,null,null,null,null,null,null,null,null,"E.  PROGRAMS AND SERVICES FOR ELs AND THEIR FAMILIES (CONTINUED)",null,null,null,null,null,null,null,null,null,null,null,null,null,null,null,"E.  PROGRAMS AND SERVICES FOR ELs AND THEIR FAMILIES (CONTINUED)",null,null,null,null,null,null,null,null,null,null,null,null,null,null,null,"E.  PROGRAMS AND SERVICES FOR ELs AND THEIR FAMILIES (CONTINUED)",null,null,null,null,null,null,null,null,null,null,null,null,null,null,null,"E.  PROGRAMS AND SERVICES FOR ELs AND THEIR FAMILIES (CONTINUED)",null,null,null,null,null,null,null,null,null,null,null,null,null,null,null,"E.  PROGRAMS AND SERVICES FOR ELs AND THEIR FAMILIES (CONTINUED)",null,null,null,null,null,null,null,null,null,null,null,null,null,null,null,"E.  PROGRAMS AND SERVICES FOR ELs AND THEIR FAMILIES (CONTINUED)",null,null,null,null,null,null,null,null,null,null,null,null,null,null,null,"E.  PROGRAMS AND SERVICES FOR ELs AND THEIR FAMILIES (CONTINUED)",null,null,null,null,null,null,null,null,null,null,null,null,null,null,null,"E.  PROGRAMS AND SERVICES FOR ELs AND THEIR FAMILIES (CONTINUED)",null,null,null,null,null,null,null,null,null,null,null,null,null,null,null,"E.  PROGRAMS AND SERVICES FOR ELs AND THEIR FAMILIES (CONTINUED)",null,null,null,null,null,null,null,null,null,null,null,null,null,null,null,"E.  PROGRAMS AND SERVICES FOR ELs AND THEIR FAMILIES (CONTINUED)",null,null,null,null,null,null,null,null,null,null,null,null,null,null,null,"E.  PROGRAMS AND SERVICES FOR ELs AND THEIR FAMILIES (CONTINUED)",null,null,null,null,null,null,null,null,null,null,null,null,null,null,null,"E.  PROGRAMS AND SERVICES FOR ELs AND THEIR FAMILIES (CONTINUED)",null,null,null,null,null,null,null,null,null,null,null,null,null,null,null,"E.  PROGRAMS AND SERVICES FOR ELs AND THEIR FAMILIES (CONTINUED)",null,null,null,null,null,null,null,null,null,null,null,null,null,null,null,"E.  PROGRAMS AND SERVICES FOR ELs AND THEIR FAMILIES (CONTINUED)",null,null,null,null,null,null,null,null,null,null,null,null,null,null,null,"E.  PROGRAMS AND SERVICES FOR ELs AND THEIR FAMILIES (CONTINUED)",null,null,null,null,null,null,null,null,null,null,null,null,null,null,null,"E.  PROGRAMS AND SERVICES FOR ELs AND THEIR FAMILIES (CONTINUED)",null,null,null,null,null,null,null,null,null,null,null,null,null,null,null,"E.  PROGRAMS AND SERVICES FOR ELs AND THEIR FAMILIES (CONTINUED)",null,null,null,null,null,null,null,null,null,null,null,null,null,null,null,"E.  PROGRAMS AND SERVICES FOR ELs AND THEIR FAMILIES (CONTINUED)",null,null,null,null,null,null,null,null,null,null,null,null,null,null,null,"E.  PROGRAMS AND SERVICES FOR ELs AND THEIR FAMILIES (CONTINUED)",null,null,null,null,null,null,null,null,null,null,null,null,null,null,null,"E.  PROGRAMS AND SERVICES FOR ELs AND THEIR FAMILIES (CONTINUED)",null,null,null,null,null,null,null,null,null,null,null,null,null,null,null,"E.  PROGRAMS AND SERVICES FOR ELs AND THEIR FAMILIES (CONTINUED)",null,null,null,null,null,null,null,null,null,null,null,null,null,null,null,"E.  PROGRAMS AND SERVICES FOR ELs AND THEIR FAMILIES (CONTINUED)",null,null,null,null,null,null,null,null,null,null,null,null,null,null,null,"E.  PROGRAMS AND SERVICES FOR ELs AND THEIR FAMILIES (CONTINUED)",null,null,null,null,null,null,null,null,null,null,null,null,null,null,null,"E.  PROGRAMS AND SERVICES FOR ELs AND THEIR FAMILIES (CONTINUED)",null,null,null,null,null,null,null,null,null,null,null,null,null,null,null,"E.  PROGRAMS AND SERVICES FOR ELs AND THEIR FAMILIES (CONTINUED)",null,null,null,null,null,null,null,null,null,null,null,null,null,null,null,"E.  PROGRAMS AND SERVICES FOR ELs AND THEIR FAMILIES (CONTINUED)",null,null,null,null,null,null,null,null,null,null,null,null,null,null,null,"E.  PROGRAMS AND SERVICES FOR ELs AND THEIR FAMILIES (CONTINUED)",null,null,null,null,null,null,null,null,null,null,null,null,null,null,null,"E.  PROGRAMS AND SERVICES FOR ELs AND THEIR FAMILIES (CONTINUED)",null,null,null,null,null,null,null,null,null,null,null,null,null,null,null,"E.  PROGRAMS AND SERVICES FOR ELs AND THEIR FAMILIES (CONTINUED)",null,null,null,null,null,null,null,null,null,null,null,null,null,null,null,"E.  PROGRAMS AND SERVICES FOR ELs AND THEIR FAMILIES (CONTINUED)",null,null,null,null,null,null,null,null,null,null,null,null,null,null,null,"E.  PROGRAMS AND SERVICES FOR ELs AND THEIR FAMILIES (CONTINUED)",null,null,null,null,null,null,null,null,null,null,null,null,null,null,null,"E.  PROGRAMS AND SERVICES FOR ELs AND THEIR FAMILIES (CONTINUED)",null,null,null,null,null,null,null,null,null,null,null,null,null,null,null,"E.  PROGRAMS AND SERVICES FOR ELs AND THEIR FAMILIES (CONTINUED)",null,null,null,null,null,null,null,null,null,null,null,null,null,null,null,"E.  PROGRAMS AND SERVICES FOR ELs AND THEIR FAMILIES (CONTINUED)",null,null,null,null,null,null,null,null,null,null,null,null,null,null,null,"E.  PROGRAMS AND SERVICES FOR ELs AND THEIR FAMILIES (CONTINUED)",null,null,null,null,null,null,null,null,null,null,null,null,null,null,null,"E.  PROGRAMS AND SERVICES FOR ELs AND THEIR FAMILIES (CONTINUED)",null,null,null,null,null,null,null,null,null,null,null,null,null,null,null,"E.  PROGRAMS AND SERVICES FOR ELs AND THEIR FAMILIES (CONTINUED)",null,null,null,null,null,null,null,null,null,null,null,null,null,null,null,"E.  PROGRAMS AND SERVICES FOR ELs AND THEIR FAMILIES (CONTINUED)",null,null,null,null,null,null,null,null,null,null,null,null,null,null,null,"E.  PROGRAMS AND SERVICES FOR ELs AND THEIR FAMILIES (CONTINUED)",null,null,null,null,null,null,null,null,null,null,null,null,null,null,null,"E.  PROGRAMS AND SERVICES FOR ELs AND THEIR FAMILIES (CONTINUED)",null,null,null,null,null,null,null,null,null,null,null,null,null,null,null,"E.  PROGRAMS AND SERVICES FOR ELs AND THEIR FAMILIES (CONTINUED)",null,null,null,null,null,null,null,null,null,null,null,null,null,null,null,"E.  PROGRAMS AND SERVICES FOR ELs AND THEIR FAMILIES (CONTINUED)",null,null,null,null,null,null,null,null,null,null,null,null,null,null,null,"E.  PROGRAMS AND SERVICES FOR ELs AND THEIR FAMILIES (CONTINUED)",null,null,null,null,null,null,null,null,null,null,null,null,null,null,null,"E.  PROGRAMS AND SERVICES FOR ELs AND THEIR FAMILIES (CONTINUED)",null,null,null,null,null,null,null,null,null,null,null,null,null,null,null,"E.  PROGRAMS AND SERVICES FOR ELs AND THEIR FAMILIES (CONTINUED)",null,null,null,null,null,null,null,null,null,null,null,null,null,null,null,"E.  PROGRAMS AND SERVICES FOR ELs AND THEIR FAMILIES (CONTINUED)",null,null,null,null,null,null,null,null,null,null,null,null,null,null,null,"E.  PROGRAMS AND SERVICES FOR ELs AND THEIR FAMILIES (CONTINUED)",null,null,null,null,null,null,null,null,null,null,null,null,null,null,null,"E.  PROGRAMS AND SERVICES FOR ELs AND THEIR FAMILIES (CONTINUED)",null,null,null,null,null,null,null,null,null,null,null,null,null,null,null,"E.  PROGRAMS AND SERVICES FOR ELs AND THEIR FAMILIES (CONTINUED)",null,null,null,null,null,null,null,null,null,null,null,null,null,null,null,"E.  PROGRAMS AND SERVICES FOR ELs AND THEIR FAMILIES (CONTINUED)",null,null,null,null,null,null,null,null,null,null,null,null,null,null,null,"E.  PROGRAMS AND SERVICES FOR ELs AND THEIR FAMILIES (CONTINUED)",null,null,null,null,null,null,null,null,null,null,null,null,null,null,null,"E.  PROGRAMS AND SERVICES FOR ELs AND THEIR FAMILIES (CONTINUED)",null,null,null,null,null,null,null,null,null,null,null,null,null,null,null,"E.  PROGRAMS AND SERVICES FOR ELs AND THEIR FAMILIES (CONTINUED)",null,null,null,null,null,null,null,null,null,null,null,null,null,null,null,"E.  PROGRAMS AND SERVICES FOR ELs AND THEIR FAMILIES (CONTINUED)",null,null,null,null,null,null,null,null,null,null,null,null,null,null,null,"E.  PROGRAMS AND SERVICES FOR ELs AND THEIR FAMILIES (CONTINUED)",null,null,null,null,null,null,null,null,null,null,null,null,null,null,null,"E.  PROGRAMS AND SERVICES FOR ELs AND THEIR FAMILIES (CONTINUED)",null,null,null,null,null,null,null,null,null,null,null,null,null,null,null,"E.  PROGRAMS AND SERVICES FOR ELs AND THEIR FAMILIES (CONTINUED)",null,null,null,null,null,null,null,null,null,null,null,null,null,null,null,"E.  PROGRAMS AND SERVICES FOR ELs AND THEIR FAMILIES (CONTINUED)",null,null,null,null,null,null,null,null,null,null,null,null,null,null,null,"E.  PROGRAMS AND SERVICES FOR ELs AND THEIR FAMILIES (CONTINUED)",null,null,null,null,null,null,null,null,null,null,null,null,null,null,null,"E.  PROGRAMS AND SERVICES FOR ELs AND THEIR FAMILIES (CONTINUED)",null,null,null,null,null,null,null,null,null,null,null,null,null,null,null,"E.  PROGRAMS AND SERVICES FOR ELs AND THEIR FAMILIES (CONTINUED)",null,null,null,null,null,null,null,null,null,null,null,null,null,null,null,"E.  PROGRAMS AND SERVICES FOR ELs AND THEIR FAMILIES (CONTINUED)",null,null,null,null,null,null,null,null,null,null,null,null,null,null,null,"E.  PROGRAMS AND SERVICES FOR ELs AND THEIR FAMILIES (CONTINUED)",null,null,null,null,null,null,null,null,null,null,null,null,null,null,null,"E.  PROGRAMS AND SERVICES FOR ELs AND THEIR FAMILIES (CONTINUED)",null,null,null,null,null,null,null,null,null,null,null,null,null,null,null,"E.  PROGRAMS AND SERVICES FOR ELs AND THEIR FAMILIES (CONTINUED)",null,null,null,null,null,null,null,null,null,null,null,null,null,null,null,"E.  PROGRAMS AND SERVICES FOR ELs AND THEIR FAMILIES (CONTINUED)",null,null,null,null,null,null,null,null,null,null,null,null,null,null,null,"E.  PROGRAMS AND SERVICES FOR ELs AND THEIR FAMILIES (CONTINUED)",null,null,null,null,null,null,null,null,null,null,null,null,null,null,null,"E.  PROGRAMS AND SERVICES FOR ELs AND THEIR FAMILIES (CONTINUED)",null,null,null,null,null,null,null,null,null,null,null,null,null,null,null,"E.  PROGRAMS AND SERVICES FOR ELs AND THEIR FAMILIES (CONTINUED)",null,null,null,null,null,null,null,null,null,null,null,null,null,null,null,"E.  PROGRAMS AND SERVICES FOR ELs AND THEIR FAMILIES (CONTINUED)",null,null,null,null,null,null,null,null,null,null,null,null,null,null,null,"E.  PROGRAMS AND SERVICES FOR ELs AND THEIR FAMILIES (CONTINUED)",null,null,null,null,null,null,null,null,null,null,null,null,null,null,null,"E.  PROGRAMS AND SERVICES FOR ELs AND THEIR FAMILIES (CONTINUED)",null,null,null,null,null,null,null,null,null,null,null,null,null,null,null,"E.  PROGRAMS AND SERVICES FOR ELs AND THEIR FAMILIES (CONTINUED)",null,null,null,null,null,null,null,null,null,null,null,null,null,null,null,"E.  PROGRAMS AND SERVICES FOR ELs AND THEIR FAMILIES (CONTINUED)",null,null,null,null,null,null,null,null,null,null,null,null,null,null,null,"E.  PROGRAMS AND SERVICES FOR ELs AND THEIR FAMILIES (CONTINUED)",null,null,null,null,null,null,null,null,null,null,null,null,null,null,null,"E.  PROGRAMS AND SERVICES FOR ELs AND THEIR FAMILIES (CONTINUED)",null,null,null,null,null,null,null,null,null,null,null,null,null,null,null,"E.  PROGRAMS AND SERVICES FOR ELs AND THEIR FAMILIES (CONTINUED)",null,null,null,null,null,null,null,null,null,null,null,null,null,null,null,"E.  PROGRAMS AND SERVICES FOR ELs AND THEIR FAMILIES (CONTINUED)",null,null,null,null,null,null,null,null,null,null,null,null,null,null,null,"E.  PROGRAMS AND SERVICES FOR ELs AND THEIR FAMILIES (CONTINUED)",null,null,null,null,null,null,null,null,null,null,null,null,null,null,null,"E.  PROGRAMS AND SERVICES FOR ELs AND THEIR FAMILIES (CONTINUED)",null,null,null,null,null,null,null,null,null,null,null,null,null,null,null,"E.  PROGRAMS AND SERVICES FOR ELs AND THEIR FAMILIES (CONTINUED)",null,null,null,null,null,null,null,null,null,null,null,null,null,null,null,"E.  PROGRAMS AND SERVICES FOR ELs AND THEIR FAMILIES (CONTINUED)",null,null,null,null,null,null,null,null,null,null,null,null,null,null,null,"E.  PROGRAMS AND SERVICES FOR ELs AND THEIR FAMILIES (CONTINUED)",null,null,null,null,null,null,null,null,null,null,null,null,null,null,null,"E.  PROGRAMS AND SERVICES FOR ELs AND THEIR FAMILIES (CONTINUED)",null,null,null,null,null,null,null,null,null,null,null,null,null,null,null,"E.  PROGRAMS AND SERVICES FOR ELs AND THEIR FAMILIES (CONTINUED)",null,null,null,null,null,null,null,null,null,null,null,null,null,null,null,"E.  PROGRAMS AND SERVICES FOR ELs AND THEIR FAMILIES (CONTINUED)",null,null,null,null,null,null,null,null,null,null,null,null,null,null,null,"E.  PROGRAMS AND SERVICES FOR ELs AND THEIR FAMILIES (CONTINUED)",null,null,null,null,null,null,null,null,null,null,null,null,null,null,null,"E.  PROGRAMS AND SERVICES FOR ELs AND THEIR FAMILIES (CONTINUED)",null,null,null,null,null,null,null,null,null,null,null,null,null,null,null,"E.  PROGRAMS AND SERVICES FOR ELs AND THEIR FAMILIES (CONTINUED)",null,null,null,null,null,null,null,null,null,null,null,null,null,null,null,"E.  PROGRAMS AND SERVICES FOR ELs AND THEIR FAMILIES (CONTINUED)",null,null,null,null,null,null,null,null,null,null,null,null,null,null,null,"E.  PROGRAMS AND SERVICES FOR ELs AND THEIR FAMILIES (CONTINUED)",null,null,null,null,null,null,null,null,null,null,null,null,null,null,null,"E.  PROGRAMS AND SERVICES FOR ELs AND THEIR FAMILIES (CONTINUED)",null,null,null,null,null,null,null,null,null,null,null,null,null,null,null,"E.  PROGRAMS AND SERVICES FOR ELs AND THEIR FAMILIES (CONTINUED)",null,null,null,null,null,null,null,null,null,null,null,null,null,null,null,"E.  PROGRAMS AND SERVICES FOR ELs AND THEIR FAMILIES (CONTINUED)",null,null,null,null,null,null,null,null,null,null,null,null,null,null,null,"E.  PROGRAMS AND SERVICES FOR ELs AND THEIR FAMILIES (CONTINUED)",null,null,null,null,null,null,null,null,null,null,null,null,null,null,null,"E.  PROGRAMS AND SERVICES FOR ELs AND THEIR FAMILIES (CONTINUED)",null,null,null,null,null,null,null,null,null,null,null,null,null,null,null,"E.  PROGRAMS AND SERVICES FOR ELs AND THEIR FAMILIES (CONTINUED)",null,null,null,null,null,null,null,null,null,null,null,null,null,null,null,"E.  PROGRAMS AND SERVICES FOR ELs AND THEIR FAMILIES (CONTINUED)",null,null,null,null,null,null,null,null,null,null,null,null,null,null,null,"E.  PROGRAMS AND SERVICES FOR ELs AND THEIR FAMILIES (CONTINUED)",null,null,null,null,null,null,null,null,null,null,null,null,null,null,null,"E.  PROGRAMS AND SERVICES FOR ELs AND THEIR FAMILIES (CONTINUED)",null,null,null,null,null,null,null,null,null,null,null,null,null,null,null,"E.  PROGRAMS AND SERVICES FOR ELs AND THEIR FAMILIES (CONTINUED)",null,null,null,null,null,null,null,null,null,null,null,null,null,null,null,"E.  PROGRAMS AND SERVICES FOR ELs AND THEIR FAMILIES (CONTINUED)",null,null,null,null,null,null,null,null,null,null,null,null,null,null,null,"E.  PROGRAMS AND SERVICES FOR ELs AND THEIR FAMILIES (CONTINUED)",null,null,null,null,null,null,null,null,null,null,null,null,null,null,null,"E.  PROGRAMS AND SERVICES FOR ELs AND THEIR FAMILIES (CONTINUED)",null,null,null,null,null,null,null,null,null,null,null,null,null,null,null,"E.  PROGRAMS AND SERVICES FOR ELs AND THEIR FAMILIES (CONTINUED)",null,null,null,null,null,null,null,null,null,null,null,null,null,null,null,"E.  PROGRAMS AND SERVICES FOR ELs AND THEIR FAMILIES (CONTINUED)",null,null,null,null,null,null,null,null,null,null,null,null,null,null,null,"E.  PROGRAMS AND SERVICES FOR ELs AND THEIR FAMILIES (CONTINUED)",null,null,null,null,null,null,null,null,null,null,null,null,null,null,null,"E.  PROGRAMS AND SERVICES FOR ELs AND THEIR FAMILIES (CONTINUED)",null,null,null,null,null,null,null,null,null,null,null,null,null,null,null,"E.  PROGRAMS AND SERVICES FOR ELs AND THEIR FAMILIES (CONTINUED)",null,null,null,null,null,null,null,null,null,null,null,null,null,null,null,"E.  PROGRAMS AND SERVICES FOR ELs AND THEIR FAMILIES (CONTINUED)",null,null,null,null,null,null,null,null,null,null,null,null,null,null,null,"E.  PROGRAMS AND SERVICES FOR ELs AND THEIR FAMILIES (CONTINUED)",null,null,null,null,null,null,null,null,null,null,null,null,null,null,null,"E.  PROGRAMS AND SERVICES FOR ELs AND THEIR FAMILIES (CONTINUED)",null,null,null,null,null,null,null,null,null,null,null,null,null,null,null,"E.  PROGRAMS AND SERVICES FOR ELs AND THEIR FAMILIES (CONTINUED)",null,null,null,null,null,null,null,null,null,null,null,null,null,null,null,"E.  PROGRAMS AND SERVICES FOR ELs AND THEIR FAMILIES (CONTINUED)",null,null,null,null,null,null,null,null,null,null,null,null,null,null,null,"E.  PROGRAMS AND SERVICES FOR ELs AND THEIR FAMILIES (CONTINUED)",null,null,null,null,null,null,null,null,null,null,null,null,null,null,null,"E.  PROGRAMS AND SERVICES FOR ELs AND THEIR FAMILIES (CONTINUED)",null,null,null,null,null,null,null,null,null,null,null,null,null,null,null,"E.  PROGRAMS AND SERVICES FOR ELs AND THEIR FAMILIES (CONTINUED)",null,null,null,null,null,null,null,null,null,null,null,null,null,null,null,"E.  PROGRAMS AND SERVICES FOR ELs AND THEIR FAMILIES (CONTINUED)",null,null,null,null,null,null,null,null,null,null,null,null,null,null,null,"E.  PROGRAMS AND SERVICES FOR ELs AND THEIR FAMILIES (CONTINUED)",null,null,null,null,null,null,null,null,null,null,null,null,null,null,null,"E.  PROGRAMS AND SERVICES FOR ELs AND THEIR FAMILIES (CONTINUED)",null,null,null,null,null,null,null,null,null,null,null,null,null,null,null,"E.  PROGRAMS AND SERVICES FOR ELs AND THEIR FAMILIES (CONTINUED)",null,null,null,null,null,null,null,null,null,null,null,null,null,null,null,"E.  PROGRAMS AND SERVICES FOR ELs AND THEIR FAMILIES (CONTINUED)",null,null,null,null,null,null,null,null,null,null,null,null,null,null,null,"E.  PROGRAMS AND SERVICES FOR ELs AND THEIR FAMILIES (CONTINUED)",null,null,null,null,null,null,null,null,null,null,null,null,null,null,null,"E.  PROGRAMS AND SERVICES FOR ELs AND THEIR FAMILIES (CONTINUED)",null,null,null,null,null,null,null,null,null,null,null,null,null,null,null,"E.  PROGRAMS AND SERVICES FOR ELs AND THEIR FAMILIES (CONTINUED)",null,null,null,null,null,null,null,null,null,null,null,null,null,null,null,"E.  PROGRAMS AND SERVICES FOR ELs AND THEIR FAMILIES (CONTINUED)",null,null,null,null,null,null,null,null,null,null,null,null,null,null,null,"E.  PROGRAMS AND SERVICES FOR ELs AND THEIR FAMILIES (CONTINUED)",null,null,null,null,null,null,null,null,null,null,null,null,null,null,null,"E.  PROGRAMS AND SERVICES FOR ELs AND THEIR FAMILIES (CONTINUED)",null,null,null,null,null,null,null,null,null,null,null,null,null,null,null,"E.  PROGRAMS AND SERVICES FOR ELs AND THEIR FAMILIES (CONTINUED)",null,null,null,null,null,null,null,null,null,null,null,null,null,null,null,"E.  PROGRAMS AND SERVICES FOR ELs AND THEIR FAMILIES (CONTINUED)",null,null,null,null,null,null,null,null,null,null,null,null,null,null,null,"E.  PROGRAMS AND SERVICES FOR ELs AND THEIR FAMILIES (CONTINUED)",null,null,null,null,null,null,null,null,null,null,null,null,null,null,null,"E.  PROGRAMS AND SERVICES FOR ELs AND THEIR FAMILIES (CONTINUED)",null,null,null,null,null,null,null,null,null,null,null,null,null,null,null,"E.  PROGRAMS AND SERVICES FOR ELs AND THEIR FAMILIES (CONTINUED)",null,null,null,null,null,null,null,null,null,null,null,null,null,null,null,"E.  PROGRAMS AND SERVICES FOR ELs AND THEIR FAMILIES (CONTINUED)",null,null,null,null,null,null,null,null,null,null,null,null,null,null,null,"E.  PROGRAMS AND SERVICES FOR ELs AND THEIR FAMILIES (CONTINUED)",null,null,null,null,null,null,null,null,null,null,null,null,null,null,null,"E.  PROGRAMS AND SERVICES FOR ELs AND THEIR FAMILIES (CONTINUED)",null,null,null,null,null,null,null,null,null,null,null,null,null,null,null,"E.  PROGRAMS AND SERVICES FOR ELs AND THEIR FAMILIES (CONTINUED)",null,null,null,null,null,null,null,null,null,null,null,null,null,null,null,"E.  PROGRAMS AND SERVICES FOR ELs AND THEIR FAMILIES (CONTINUED)",null,null,null,null,null,null,null,null,null,null,null,null,null,null,null,"E.  PROGRAMS AND SERVICES FOR ELs AND THEIR FAMILIES (CONTINUED)",null,null,null,null,null,null,null,null,null,null,null,null,null,null,null,"E.  PROGRAMS AND SERVICES FOR ELs AND THEIR FAMILIES (CONTINUED)",null,null,null,null,null,null,null,null,null,null,null,null,null,null,null,"E.  PROGRAMS AND SERVICES FOR ELs AND THEIR FAMILIES (CONTINUED)",null,null,null,null,null,null,null,null,null,null,null,null,null,null,null,"E.  PROGRAMS AND SERVICES FOR ELs AND THEIR FAMILIES (CONTINUED)",null,null,null,null,null,null,null,null,null,null,null,null,null,null,null,"E.  PROGRAMS AND SERVICES FOR ELs AND THEIR FAMILIES (CONTINUED)",null,null,null,null,null,null,null,null,null,null,null,null,null,null,null,"E.  PROGRAMS AND SERVICES FOR ELs AND THEIR FAMILIES (CONTINUED)",null,null,null,null,null,null,null,null,null,null,null,null,null,null,null,"E.  PROGRAMS AND SERVICES FOR ELs AND THEIR FAMILIES (CONTINUED)",null,null,null,null,null,null,null,null,null,null,null,null,null,null,null,"E.  PROGRAMS AND SERVICES FOR ELs AND THEIR FAMILIES (CONTINUED)",null,null,null,null,null,null,null,null,null,null,null,null,null,null,null,"E.  PROGRAMS AND SERVICES FOR ELs AND THEIR FAMILIES (CONTINUED)",null,null,null,null,null,null,null,null,null,null,null,null,null,null,null,"E.  PROGRAMS AND SERVICES FOR ELs AND THEIR FAMILIES (CONTINUED)",null,null,null,null,null,null,null,null,null,null,null,null,null,null,null,"E.  PROGRAMS AND SERVICES FOR ELs AND THEIR FAMILIES (CONTINUED)",null,null,null,null,null,null,null,null,null,null,null,null,null,null,null,"E.  PROGRAMS AND SERVICES FOR ELs AND THEIR FAMILIES (CONTINUED)",null,null,null,null,null,null,null,null,null,null,null,null,null,null,null,"E.  PROGRAMS AND SERVICES FOR ELs AND THEIR FAMILIES (CONTINUED)",null,null,null,null,null,null,null,null,null,null,null,null,null,null,null,"E.  PROGRAMS AND SERVICES FOR ELs AND THEIR FAMILIES (CONTINUED)",null,null,null,null,null,null,null,null,null,null,null,null,null,null,null,"E.  PROGRAMS AND SERVICES FOR ELs AND THEIR FAMILIES (CONTINUED)",null,null,null,null,null,null,null,null,null,null,null,null,null,null,null,"E.  PROGRAMS AND SERVICES FOR ELs AND THEIR FAMILIES (CONTINUED)",null,null,null,null,null,null,null,null,null,null,null,null,null,null,null,"E.  PROGRAMS AND SERVICES FOR ELs AND THEIR FAMILIES (CONTINUED)",null,null,null,null,null,null,null,null,null,null,null,null,null,null,null,"E.  PROGRAMS AND SERVICES FOR ELs AND THEIR FAMILIES (CONTINUED)",null,null,null,null,null,null,null,null,null,null,null,null,null,null,null,"E.  PROGRAMS AND SERVICES FOR ELs AND THEIR FAMILIES (CONTINUED)",null,null,null,null,null,null,null,null,null,null,null,null,null,null,null,"E.  PROGRAMS AND SERVICES FOR ELs AND THEIR FAMILIES (CONTINUED)",null,null,null,null,null,null,null,null,null,null,null,null,null,null,null,"E.  PROGRAMS AND SERVICES FOR ELs AND THEIR FAMILIES (CONTINUED)",null,null,null,null,null,null,null,null,null,null,null,null,null,null,null,"E.  PROGRAMS AND SERVICES FOR ELs AND THEIR FAMILIES (CONTINUED)",null,null,null,null,null,null,null,null,null,null,null,null,null,null,null,"E.  PROGRAMS AND SERVICES FOR ELs AND THEIR FAMILIES (CONTINUED)",null,null,null,null,null,null,null,null,null,null,null,null,null,null,null,"E.  PROGRAMS AND SERVICES FOR ELs AND THEIR FAMILIES (CONTINUED)",null,null,null,null,null,null,null,null,null,null,null,null,null,null,null,"E.  PROGRAMS AND SERVICES FOR ELs AND THEIR FAMILIES (CONTINUED)",null,null,null,null,null,null,null,null,null,null,null,null,null,null,null,"E.  PROGRAMS AND SERVICES FOR ELs AND THEIR FAMILIES (CONTINUED)",null,null,null,null,null,null,null,null,null,null,null,null,null,null,null,"E.  PROGRAMS AND SERVICES FOR ELs AND THEIR FAMILIES (CONTINUED)",null,null,null,null,null,null,null,null,null,null,null,null,null,null,null,"E.  PROGRAMS AND SERVICES FOR ELs AND THEIR FAMILIES (CONTINUED)",null,null,null,null,null,null,null,null,null,null,null,null,null,null,null,"E.  PROGRAMS AND SERVICES FOR ELs AND THEIR FAMILIES (CONTINUED)",null,null,null,null,null,null,null,null,null,null,null,null,null,null,null,"E.  PROGRAMS AND SERVICES FOR ELs AND THEIR FAMILIES (CONTINUED)",null,null,null,null,null,null,null,null,null,null,null,null,null,null,null,"E.  PROGRAMS AND SERVICES FOR ELs AND THEIR FAMILIES (CONTINUED)",null,null,null,null,null,null,null,null,null,null,null,null,null,null,null,"E.  PROGRAMS AND SERVICES FOR ELs AND THEIR FAMILIES (CONTINUED)",null,null,null,null,null,null,null,null,null,null,null,null,null,null,null,"E.  PROGRAMS AND SERVICES FOR ELs AND THEIR FAMILIES (CONTINUED)",null,null,null,null,null,null,null,null,null,null,null,null,null,null,null,"E.  PROGRAMS AND SERVICES FOR ELs AND THEIR FAMILIES (CONTINUED)",null,null,null,null,null,null,null,null,null,null,null,null,null,null,null,"E.  PROGRAMS AND SERVICES FOR ELs AND THEIR FAMILIES (CONTINUED)",null,null,null,null,null,null,null,null,null,null,null,null,null,null,null,"E.  PROGRAMS AND SERVICES FOR ELs AND THEIR FAMILIES (CONTINUED)",null,null,null,null,null,null,null,null,null,null,null,null,null,null,null,"E.  PROGRAMS AND SERVICES FOR ELs AND THEIR FAMILIES (CONTINUED)",null,null,null,null,null,null,null,null,null,null,null,null,null,null,null,"E.  PROGRAMS AND SERVICES FOR ELs AND THEIR FAMILIES (CONTINUED)",null,null,null,null,null,null,null,null,null,null,null,null,null,null,null,"E.  PROGRAMS AND SERVICES FOR ELs AND THEIR FAMILIES (CONTINUED)",null,null,null,null,null,null,null,null,null,null,null,null,null,null,null,"E.  PROGRAMS AND SERVICES FOR ELs AND THEIR FAMILIES (CONTINUED)",null,null,null,null,null,null,null,null,null,null,null,null,null,null,null,"E.  PROGRAMS AND SERVICES FOR ELs AND THEIR FAMILIES (CONTINUED)",null,null,null,null,null,null,null,null,null,null,null,null,null,null,null,"E.  PROGRAMS AND SERVICES FOR ELs AND THEIR FAMILIES (CONTINUED)",null,null,null,null,null,null,null,null,null,null,null,null,null,null,null,"E.  PROGRAMS AND SERVICES FOR ELs AND THEIR FAMILIES (CONTINUED)",null,null,null,null,null,null,null,null,null,null,null,null,null,null,null,"E.  PROGRAMS AND SERVICES FOR ELs AND THEIR FAMILIES (CONTINUED)",null,null,null,null,null,null,null,null,null,null,null,null,null,null,null,"E.  PROGRAMS AND SERVICES FOR ELs AND THEIR FAMILIES (CONTINUED)",null,null,null,null,null,null,null,null,null,null,null,null,null,null,null,"E.  PROGRAMS AND SERVICES FOR ELs AND THEIR FAMILIES (CONTINUED)",null,null,null,null,null,null,null,null,null,null,null,null,null,null,null,"E.  PROGRAMS AND SERVICES FOR ELs AND THEIR FAMILIES (CONTINUED)",null,null,null,null,null,null,null,null,null,null,null,null,null,null,null,"E.  PROGRAMS AND SERVICES FOR ELs AND THEIR FAMILIES (CONTINUED)",null,null,null,null,null,null,null,null,null,null,null,null,null,null,null,"E.  PROGRAMS AND SERVICES FOR ELs AND THEIR FAMILIES (CONTINUED)",null,null,null,null,null,null,null,null,null,null,null,null,null,null,null,"E.  PROGRAMS AND SERVICES FOR ELs AND THEIR FAMILIES (CONTINUED)",null,null,null,null,null,null,null,null,null,null,null,null,null,null,null,"E.  PROGRAMS AND SERVICES FOR ELs AND THEIR FAMILIES (CONTINUED)",null,null,null,null,null,null,null,null,null,null,null,null,null,null,null,"E.  PROGRAMS AND SERVICES FOR ELs AND THEIR FAMILIES (CONTINUED)",null,null,null,null,null,null,null,null,null,null,null,null,null,null,null,"E.  PROGRAMS AND SERVICES FOR ELs AND THEIR FAMILIES (CONTINUED)",null,null,null,null,null,null,null,null,null,null,null,null,null,null,null,"E.  PROGRAMS AND SERVICES FOR ELs AND THEIR FAMILIES (CONTINUED)",null,null,null,null,null,null,null,null,null,null,null,null,null,null,null,"E.  PROGRAMS AND SERVICES FOR ELs AND THEIR FAMILIES (CONTINUED)",null,null,null,null,null,null,null,null,null,null,null,null,null,null,null,"E.  PROGRAMS AND SERVICES FOR ELs AND THEIR FAMILIES (CONTINUED)",null,null,null,null,null,null,null,null,null,null,null,null,null,null,null,"E.  PROGRAMS AND SERVICES FOR ELs AND THEIR FAMILIES (CONTINUED)",null,null,null,null,null,null,null,null,null,null,null,null,null,null,null,"E.  PROGRAMS AND SERVICES FOR ELs AND THEIR FAMILIES (CONTINUED)",null,null,null,null,null,null,null,null,null,null,null,null,null,null,null,"E.  PROGRAMS AND SERVICES FOR ELs AND THEIR FAMILIES (CONTINUED)",null,null,null,null,null,null,null,null,null,null,null,null,null,null,null,"E.  PROGRAMS AND SERVICES FOR ELs AND THEIR FAMILIES (CONTINUED)",null,null,null,null,null,null,null,null,null,null,null,null,null,null,null,"E.  PROGRAMS AND SERVICES FOR ELs AND THEIR FAMILIES (CONTINUED)",null,null,null,null,null,null,null,null,null,null,null,null,null,null,null,"E.  PROGRAMS AND SERVICES FOR ELs AND THEIR FAMILIES (CONTINUED)",null,null,null,null,null,null,null,null,null,null,null,null,null,null,null,"E.  PROGRAMS AND SERVICES FOR ELs AND THEIR FAMILIES (CONTINUED)",null,null,null,null,null,null,null,null,null,null,null,null,null,null,null,"E.  PROGRAMS AND SERVICES FOR ELs AND THEIR FAMILIES (CONTINUED)",null,null,null,null,null,null,null,null,null,null,null,null,null,null,null,"E.  PROGRAMS AND SERVICES FOR ELs AND THEIR FAMILIES (CONTINUED)",null,null,null,null,null,null,null,null,null,null,null,null,null,null,null,"E.  PROGRAMS AND SERVICES FOR ELs AND THEIR FAMILIES (CONTINUED)",null,null,null,null,null,null,null,null,null,null,null,null,null,null,null,"E.  PROGRAMS AND SERVICES FOR ELs AND THEIR FAMILIES (CONTINUED)",null,null,null,null,null,null,null,null,null,null,null,null,null,null,null,"E.  PROGRAMS AND SERVICES FOR ELs AND THEIR FAMILIES (CONTINUED)",null,null,null,null,null,null,null,null,null,null,null,null,null,null,null,"E.  PROGRAMS AND SERVICES FOR ELs AND THEIR FAMILIES (CONTINUED)",null,null,null,null,null,null,null,null,null,null,null,null,null,null,null,"E.  PROGRAMS AND SERVICES FOR ELs AND THEIR FAMILIES (CONTINUED)",null,null,null,null,null,null,null,null,null,null,null,null,null,null,null,"E.  PROGRAMS AND SERVICES FOR ELs AND THEIR FAMILIES (CONTINUED)",null,null,null,null,null,null,null,null,null,null,null,null,null,null,null,"E.  PROGRAMS AND SERVICES FOR ELs AND THEIR FAMILIES (CONTINUED)",null,null,null,null,null,null,null,null,null,null,null,null,null,null,null,"E.  PROGRAMS AND SERVICES FOR ELs AND THEIR FAMILIES (CONTINUED)",null,null,null,null,null,null,null,null,null,null,null,null,null,null,null,"E.  PROGRAMS AND SERVICES FOR ELs AND THEIR FAMILIES (CONTINUED)",null,null,null,null,null,null,null,null,null,null,null,null,null,null,null,"E.  PROGRAMS AND SERVICES FOR ELs AND THEIR FAMILIES (CONTINUED)",null,null,null,null,null,null,null,null,null,null,null,null,null,null,null,"E.  PROGRAMS AND SERVICES FOR ELs AND THEIR FAMILIES (CONTINUED)",null,null,null,null,null,null,null,null,null,null,null,null,null,null,null,"E.  PROGRAMS AND SERVICES FOR ELs AND THEIR FAMILIES (CONTINUED)",null,null,null,null,null,null,null,null,null,null,null,null,null,null,null,"E.  PROGRAMS AND SERVICES FOR ELs AND THEIR FAMILIES (CONTINUED)",null,null,null,null,null,null,null,null,null,null,null,null,null,null,null,"E.  PROGRAMS AND SERVICES FOR ELs AND THEIR FAMILIES (CONTINUED)",null,null,null,null,null,null,null,null,null,null,null,null,null,null,null,"E.  PROGRAMS AND SERVICES FOR ELs AND THEIR FAMILIES (CONTINUED)",null,null,null,null,null,null,null,null,null,null,null,null,null,null,null,"E.  PROGRAMS AND SERVICES FOR ELs AND THEIR FAMILIES (CONTINUED)",null,null,null,null,null,null,null,null,null,null,null,null,null,null,null,"E.  PROGRAMS AND SERVICES FOR ELs AND THEIR FAMILIES (CONTINUED)",null,null,null,null,null,null,null,null,null,null,null,null,null,null,null,"E.  PROGRAMS AND SERVICES FOR ELs AND THEIR FAMILIES (CONTINUED)",null,null,null,null,null,null,null,null,null,null,null,null,null,null,null,"E.  PROGRAMS AND SERVICES FOR ELs AND THEIR FAMILIES (CONTINUED)",null,null,null,null,null,null,null,null,null,null,null,null,null,null,null,"E.  PROGRAMS AND SERVICES FOR ELs AND THEIR FAMILIES (CONTINUED)",null,null,null,null,null,null,null,null,null,null,null,null,null,null,null,"E.  PROGRAMS AND SERVICES FOR ELs AND THEIR FAMILIES (CONTINUED)",null,null,null,null,null,null,null,null,null,null,null,null,null,null,null,"E.  PROGRAMS AND SERVICES FOR ELs AND THEIR FAMILIES (CONTINUED)",null,null,null,null,null,null,null,null,null,null,null,null,null,null,null,"E.  PROGRAMS AND SERVICES FOR ELs AND THEIR FAMILIES (CONTINUED)",null,null,null,null,null,null,null,null,null,null,null,null,null,null,null,"E.  PROGRAMS AND SERVICES FOR ELs AND THEIR FAMILIES (CONTINUED)",null,null,null,null,null,null,null,null,null,null,null,null,null,null,null,"E.  PROGRAMS AND SERVICES FOR ELs AND THEIR FAMILIES (CONTINUED)",null,null,null,null,null,null,null,null,null,null,null,null,null,null,null,"E.  PROGRAMS AND SERVICES FOR ELs AND THEIR FAMILIES (CONTINUED)",null,null,null,null,null,null,null,null,null,null,null,null,null,null,null,"E.  PROGRAMS AND SERVICES FOR ELs AND THEIR FAMILIES (CONTINUED)",null,null,null,null,null,null,null,null,null,null,null,null,null,null,null,"E.  PROGRAMS AND SERVICES FOR ELs AND THEIR FAMILIES (CONTINUED)",null,null,null,null,null,null,null,null,null,null,null,null,null,null,null,"E.  PROGRAMS AND SERVICES FOR ELs AND THEIR FAMILIES (CONTINUED)",null,null,null,null,null,null,null,null,null,null,null,null,null,null,null,"E.  PROGRAMS AND SERVICES FOR ELs AND THEIR FAMILIES (CONTINUED)",null,null,null,null,null,null,null,null,null,null,null,null,null,null,null,"E.  PROGRAMS AND SERVICES FOR ELs AND THEIR FAMILIES (CONTINUED)",null,null,null,null,null,null,null,null,null,null,null,null,null,null,null,"E.  PROGRAMS AND SERVICES FOR ELs AND THEIR FAMILIES (CONTINUED)",null,null,null,null,null,null,null,null,null,null,null,null,null,null,null,"E.  PROGRAMS AND SERVICES FOR ELs AND THEIR FAMILIES (CONTINUED)",null,null,null,null,null,null,null,null,null,null,null,null,null,null,null,"E.  PROGRAMS AND SERVICES FOR ELs AND THEIR FAMILIES (CONTINUED)",null,null,null,null,null,null,null,null,null,null,null,null,null,null,null,"E.  PROGRAMS AND SERVICES FOR ELs AND THEIR FAMILIES (CONTINUED)",null,null,null,null,null,null,null,null,null,null,null,null,null,null,null,"E.  PROGRAMS AND SERVICES FOR ELs AND THEIR FAMILIES (CONTINUED)",null,null,null,null,null,null,null,null,null,null,null,null,null,null,null,"E.  PROGRAMS AND SERVICES FOR ELs AND THEIR FAMILIES (CONTINUED)",null,null,null,null,null,null,null,null,null,null,null,null,null,null,null,"E.  PROGRAMS AND SERVICES FOR ELs AND THEIR FAMILIES (CONTINUED)",null,null,null,null,null,null,null,null,null,null,null,null,null,null,null,"E.  PROGRAMS AND SERVICES FOR ELs AND THEIR FAMILIES (CONTINUED)",null,null,null,null,null,null,null,null,null,null,null,null,null,null,null,"E.  PROGRAMS AND SERVICES FOR ELs AND THEIR FAMILIES (CONTINUED)",null,null,null,null,null,null,null,null,null,null,null,null,null,null,null,"E.  PROGRAMS AND SERVICES FOR ELs AND THEIR FAMILIES (CONTINUED)",null,null,null,null,null,null,null,null,null,null,null,null,null,null,null,"E.  PROGRAMS AND SERVICES FOR ELs AND THEIR FAMILIES (CONTINUED)",null,null,null,null,null,null,null,null,null,null,null,null,null,null,null,"E.  PROGRAMS AND SERVICES FOR ELs AND THEIR FAMILIES (CONTINUED)",null,null,null,null,null,null,null,null,null,null,null,null,null,null,null,"E.  PROGRAMS AND SERVICES FOR ELs AND THEIR FAMILIES (CONTINUED)",null,null,null,null,null,null,null,null,null,null,null,null,null,null,null,"E.  PROGRAMS AND SERVICES FOR ELs AND THEIR FAMILIES (CONTINUED)",null,null,null,null,null,null,null,null,null,null,null,null,null,null,null,"E.  PROGRAMS AND SERVICES FOR ELs AND THEIR FAMILIES (CONTINUED)",null,null,null,null,null,null,null,null,null,null,null,null,null,null,null,"E.  PROGRAMS AND SERVICES FOR ELs AND THEIR FAMILIES (CONTINUED)",null,null,null,null,null,null,null,null,null,null,null,null,null,null,null,"E.  PROGRAMS AND SERVICES FOR ELs AND THEIR FAMILIES (CONTINUED)",null,null,null,null,null,null,null,null,null,null,null,null,null,null,null,"E.  PROGRAMS AND SERVICES FOR ELs AND THEIR FAMILIES (CONTINUED)",null,null,null,null,null,null,null,null,null,null,null,null,null,null,null,"E.  PROGRAMS AND SERVICES FOR ELs AND THEIR FAMILIES (CONTINUED)",null,null,null,null,null,null,null,null,null,null,null,null,null,null,null,"E.  PROGRAMS AND SERVICES FOR ELs AND THEIR FAMILIES (CONTINUED)",null,null,null,null,null,null,null,null,null,null,null,null,null,null,null,"E.  PROGRAMS AND SERVICES FOR ELs AND THEIR FAMILIES (CONTINUED)",null,null,null,null,null,null,null,null,null,null,null,null,null,null,null,"E.  PROGRAMS AND SERVICES FOR ELs AND THEIR FAMILIES (CONTINUED)",null,null,null,null,null,null,null,null,null,null,null,null,null,null,null,"E.  PROGRAMS AND SERVICES FOR ELs AND THEIR FAMILIES (CONTINUED)",null,null,null,null,null,null,null,null,null,null,null,null,null,null,null,"E.  PROGRAMS AND SERVICES FOR ELs AND THEIR FAMILIES (CONTINUED)",null,null,null,null,null,null,null,null,null,null,null,null,null,null,null,"E.  PROGRAMS AND SERVICES FOR ELs AND THEIR FAMILIES (CONTINUED)",null,null,null,null,null,null,null,null,null,null,null,null,null,null,null,"E.  PROGRAMS AND SERVICES FOR ELs AND THEIR FAMILIES (CONTINUED)",null,null,null,null,null,null,null,null,null,null,null,null,null,null,null,"E.  PROGRAMS AND SERVICES FOR ELs AND THEIR FAMILIES (CONTINUED)",null,null,null,null,null,null,null,null,null,null,null,null,null,null,null,"E.  PROGRAMS AND SERVICES FOR ELs AND THEIR FAMILIES (CONTINUED)",null,null,null,null,null,null,null,null,null,null,null,null,null,null,null,"E.  PROGRAMS AND SERVICES FOR ELs AND THEIR FAMILIES (CONTINUED)",null,null,null,null,null,null,null,null,null,null,null,null,null,null,null,"E.  PROGRAMS AND SERVICES FOR ELs AND THEIR FAMILIES (CONTINUED)",null,null,null,null,null,null,null,null,null,null,null,null,null,null,null,"E.  PROGRAMS AND SERVICES FOR ELs AND THEIR FAMILIES (CONTINUED)",null,null,null,null,null,null,null,null,null,null,null,null,null,null,null,"E.  PROGRAMS AND SERVICES FOR ELs AND THEIR FAMILIES (CONTINUED)",null,null,null,null,null,null,null,null,null,null,null,null,null,null,null,"E.  PROGRAMS AND SERVICES FOR ELs AND THEIR FAMILIES (CONTINUED)",null,null,null,null,null,null,null,null,null,null,null,null,null,null,null,"E.  PROGRAMS AND SERVICES FOR ELs AND THEIR FAMILIES (CONTINUED)",null,null,null,null,null,null,null,null,null,null,null,null,null,null,null,"E.  PROGRAMS AND SERVICES FOR ELs AND THEIR FAMILIES (CONTINUED)",null,null,null,null,null,null,null,null,null,null,null,null,null,null,null,"E.  PROGRAMS AND SERVICES FOR ELs AND THEIR FAMILIES (CONTINUED)",null,null,null,null,null,null,null,null,null,null,null,null,null,null,null,"E.  PROGRAMS AND SERVICES FOR ELs AND THEIR FAMILIES (CONTINUED)",null,null,null,null,null,null,null,null,null,null,null,null,null,null,null,"E.  PROGRAMS AND SERVICES FOR ELs AND THEIR FAMILIES (CONTINUED)",null,null,null,null,null,null,null,null,null,null,null,null,null,null,null,"E.  PROGRAMS AND SERVICES FOR ELs AND THEIR FAMILIES (CONTINUED)",null,null,null,null,null,null,null,null,null,null,null,null,null,null,null,"E.  PROGRAMS AND SERVICES FOR ELs AND THEIR FAMILIES (CONTINUED)",null,null,null,null,null,null,null,null,null,null,null,null,null,null,null,"E.  PROGRAMS AND SERVICES FOR ELs AND THEIR FAMILIES (CONTINUED)",null,null,null,null,null,null,null,null,null,null,null,null,null,null,null,"E.  PROGRAMS AND SERVICES FOR ELs AND THEIR FAMILIES (CONTINUED)",null,null,null,null,null,null,null,null,null,null,null,null,null,null,null,"E.  PROGRAMS AND SERVICES FOR ELs AND THEIR FAMILIES (CONTINUED)",null,null,null,null,null,null,null,null,null,null,null,null,null,null,null,"E.  PROGRAMS AND SERVICES FOR ELs AND THEIR FAMILIES (CONTINUED)",null,null,null,null,null,null,null,null,null,null,null,null,null,null,null,"E.  PROGRAMS AND SERVICES FOR ELs AND THEIR FAMILIES (CONTINUED)",null,null,null,null,null,null,null,null,null,null,null,null,null,null,null,"E.  PROGRAMS AND SERVICES FOR ELs AND THEIR FAMILIES (CONTINUED)",null,null,null,null,null,null,null,null,null,null,null,null,null,null,null,"E.  PROGRAMS AND SERVICES FOR ELs AND THEIR FAMILIES (CONTINUED)",null,null,null,null,null,null,null,null,null,null,null,null,null,null,null,"E.  PROGRAMS AND SERVICES FOR ELs AND THEIR FAMILIES (CONTINUED)",null,null,null,null,null,null,null,null,null,null,null,null,null,null,null,"E.  PROGRAMS AND SERVICES FOR ELs AND THEIR FAMILIES (CONTINUED)",null,null,null,null,null,null,null,null,null,null,null,null,null,null,null,"E.  PROGRAMS AND SERVICES FOR ELs AND THEIR FAMILIES (CONTINUED)",null,null,null,null,null,null,null,null,null,null,null,null,null,null,null,"E.  PROGRAMS AND SERVICES FOR ELs AND THEIR FAMILIES (CONTINUED)",null,null,null,null,null,null,null,null,null,null,null,null,null,null,null,"E.  PROGRAMS AND SERVICES FOR ELs AND THEIR FAMILIES (CONTINUED)",null,null,null,null,null,null,null,null,null,null,null,null,null,null,null,"E.  PROGRAMS AND SERVICES FOR ELs AND THEIR FAMILIES (CONTINUED)",null,null,null,null,null,null,null,null,null,null,null,null,null,null,null,"E.  PROGRAMS AND SERVICES FOR ELs AND THEIR FAMILIES (CONTINUED)",null,null,null,null,null,null,null,null,null,null,null,null,null,null,null,"E.  PROGRAMS AND SERVICES FOR ELs AND THEIR FAMILIES (CONTINUED)",null,null,null,null,null,null,null,null,null,null,null,null,null,null,null,"E.  PROGRAMS AND SERVICES FOR ELs AND THEIR FAMILIES (CONTINUED)",null,null,null,null,null,null,null,null,null,null,null,null,null,null,null,"E.  PROGRAMS AND SERVICES FOR ELs AND THEIR FAMILIES (CONTINUED)",null,null,null,null,null,null,null,null,null,null,null,null,null,null,null,"E.  PROGRAMS AND SERVICES FOR ELs AND THEIR FAMILIES (CONTINUED)",null,null,null,null,null,null,null,null,null,null,null,null,null,null,null,"E.  PROGRAMS AND SERVICES FOR ELs AND THEIR FAMILIES (CONTINUED)",null,null,null,null,null,null,null,null,null,null,null,null,null,null,null,"E.  PROGRAMS AND SERVICES FOR ELs AND THEIR FAMILIES (CONTINUED)",null,null,null,null,null,null,null,null,null,null,null,null,null,null,null,"E.  PROGRAMS AND SERVICES FOR ELs AND THEIR FAMILIES (CONTINUED)",null,null,null,null,null,null,null,null,null,null,null,null,null,null,null,"E.  PROGRAMS AND SERVICES FOR ELs AND THEIR FAMILIES (CONTINUED)",null,null,null,null,null,null,null,null,null,null,null,null,null,null,null,"E.  PROGRAMS AND SERVICES FOR ELs AND THEIR FAMILIES (CONTINUED)",null,null,null,null,null,null,null,null,null,null,null,null,null,null,null,"E.  PROGRAMS AND SERVICES FOR ELs AND THEIR FAMILIES (CONTINUED)",null,null,null,null,null,null,null,null,null,null,null,null,null,null,null,"E.  PROGRAMS AND SERVICES FOR ELs AND THEIR FAMILIES (CONTINUED)",null,null,null,null,null,null,null,null,null,null,null,null,null,null,null,"E.  PROGRAMS AND SERVICES FOR ELs AND THEIR FAMILIES (CONTINUED)",null,null,null,null,null,null,null,null,null,null,null,null,null,null,null,"E.  PROGRAMS AND SERVICES FOR ELs AND THEIR FAMILIES (CONTINUED)",null,null,null,null,null,null,null,null,null,null,null,null,null,null,null,"E.  PROGRAMS AND SERVICES FOR ELs AND THEIR FAMILIES (CONTINUED)",null,null,null,null,null,null,null,null,null,null,null,null,null,null,null,"E.  PROGRAMS AND SERVICES FOR ELs AND THEIR FAMILIES (CONTINUED)",null,null,null,null,null,null,null,null,null,null,null,null,null,null,null,"E.  PROGRAMS AND SERVICES FOR ELs AND THEIR FAMILIES (CONTINUED)",null,null,null,null,null,null,null,null,null,null,null,null,null,null,null,"E.  PROGRAMS AND SERVICES FOR ELs AND THEIR FAMILIES (CONTINUED)",null,null,null,null,null,null,null,null,null,null,null,null,null,null,null,"E.  PROGRAMS AND SERVICES FOR ELs AND THEIR FAMILIES (CONTINUED)",null,null,null,null,null,null,null,null,null,null,null,null,null,null,null,"E.  PROGRAMS AND SERVICES FOR ELs AND THEIR FAMILIES (CONTINUED)",null,null,null,null,null,null,null,null,null,null,null,null,null,null,null,"E.  PROGRAMS AND SERVICES FOR ELs AND THEIR FAMILIES (CONTINUED)",null,null,null,null,null,null,null,null,null,null,null,null,null,null,null,"E.  PROGRAMS AND SERVICES FOR ELs AND THEIR FAMILIES (CONTINUED)",null,null,null,null,null,null,null,null,null,null,null,null,null,null,null,"E.  PROGRAMS AND SERVICES FOR ELs AND THEIR FAMILIES (CONTINUED)",null,null,null,null,null,null,null,null,null,null,null,null,null,null,null,"E.  PROGRAMS AND SERVICES FOR ELs AND THEIR FAMILIES (CONTINUED)",null,null,null,null,null,null,null,null,null,null,null,null,null,null,null,"E.  PROGRAMS AND SERVICES FOR ELs AND THEIR FAMILIES (CONTINUED)",null,null,null,null,null,null,null,null,null,null,null,null,null,null,null,"E.  PROGRAMS AND SERVICES FOR ELs AND THEIR FAMILIES (CONTINUED)",null,null,null,null,null,null,null,null,null,null,null,null,null,null,null,"E.  PROGRAMS AND SERVICES FOR ELs AND THEIR FAMILIES (CONTINUED)",null,null,null,null,null,null,null,null,null,null,null,null,null,null,null,"E.  PROGRAMS AND SERVICES FOR ELs AND THEIR FAMILIES (CONTINUED)",null,null,null,null,null,null,null,null,null,null,null,null,null,null,null,"E.  PROGRAMS AND SERVICES FOR ELs AND THEIR FAMILIES (CONTINUED)",null,null,null,null,null,null,null,null,null,null,null,null,null,null,null,"E.  PROGRAMS AND SERVICES FOR ELs AND THEIR FAMILIES (CONTINUED)",null,null,null,null,null,null,null,null,null,null,null,null,null,null,null,"E.  PROGRAMS AND SERVICES FOR ELs AND THEIR FAMILIES (CONTINUED)",null,null,null,null,null,null,null,null,null,null,null,null,null,null,null,"E.  PROGRAMS AND SERVICES FOR ELs AND THEIR FAMILIES (CONTINUED)",null,null,null,null,null,null,null,null,null,null,null,null,null,null,null,"E.  PROGRAMS AND SERVICES FOR ELs AND THEIR FAMILIES (CONTINUED)",null,null,null,null,null,null,null,null,null,null,null,null,null,null,null,"E.  PROGRAMS AND SERVICES FOR ELs AND THEIR FAMILIES (CONTINUED)",null,null,null,null,null,null,null,null,null,null,null,null,null,null,null,"E.  PROGRAMS AND SERVICES FOR ELs AND THEIR FAMILIES (CONTINUED)",null,null,null,null,null,null,null,null,null,null,null,null,null,null,null,"E.  PROGRAMS AND SERVICES FOR ELs AND THEIR FAMILIES (CONTINUED)",null,null,null,null,null,null,null,null,null,null,null,null,null,null,null,"E.  PROGRAMS AND SERVICES FOR ELs AND THEIR FAMILIES (CONTINUED)",null,null,null,null,null,null,null,null,null,null,null,null,null,null,null,"E.  PROGRAMS AND SERVICES FOR ELs AND THEIR FAMILIES (CONTINUED)",null,null,null,null,null,null,null,null,null,null,null,null,null,null,null,"E.  PROGRAMS AND SERVICES FOR ELs AND THEIR FAMILIES (CONTINUED)",null,null,null,null,null,null,null,null,null,null,null,null,null,null,null,"E.  PROGRAMS AND SERVICES FOR ELs AND THEIR FAMILIES (CONTINUED)",null,null,null,null,null,null,null,null,null,null,null,null,null,null,null,"E.  PROGRAMS AND SERVICES FOR ELs AND THEIR FAMILIES (CONTINUED)",null,null,null,null,null,null,null,null,null,null,null,null,null,null,null,"E.  PROGRAMS AND SERVICES FOR ELs AND THEIR FAMILIES (CONTINUED)",null,null,null,null,null,null,null,null,null,null,null,null,null,null,null,"E.  PROGRAMS AND SERVICES FOR ELs AND THEIR FAMILIES (CONTINUED)",null,null,null,null,null,null,null,null,null,null,null,null,null,null,null,"E.  PROGRAMS AND SERVICES FOR ELs AND THEIR FAMILIES (CONTINUED)",null,null,null,null,null,null,null,null,null,null,null,null,null,null,null,"E.  PROGRAMS AND SERVICES FOR ELs AND THEIR FAMILIES (CONTINUED)",null,null,null,null,null,null,null,null,null,null,null,null,null,null,null,"E.  PROGRAMS AND SERVICES FOR ELs AND THEIR FAMILIES (CONTINUED)",null,null,null,null,null,null,null,null,null,null,null,null,null,null,null,"E.  PROGRAMS AND SERVICES FOR ELs AND THEIR FAMILIES (CONTINUED)",null,null,null,null,null,null,null,null,null,null,null,null,null,null,null,"E.  PROGRAMS AND SERVICES FOR ELs AND THEIR FAMILIES (CONTINUED)",null,null,null,null,null,null,null,null,null,null,null,null,null,null,null,"E.  PROGRAMS AND SERVICES FOR ELs AND THEIR FAMILIES (CONTINUED)",null,null,null,null,null,null,null,null,null,null,null,null,null,null,null,"E.  PROGRAMS AND SERVICES FOR ELs AND THEIR FAMILIES (CONTINUED)",null,null,null,null,null,null,null,null,null,null,null,null,null,null,null,"E.  PROGRAMS AND SERVICES FOR ELs AND THEIR FAMILIES (CONTINUED)",null,null,null,null,null,null,null,null,null,null,null,null,null,null,null,"E.  PROGRAMS AND SERVICES FOR ELs AND THEIR FAMILIES (CONTINUED)",null,null,null,null,null,null,null,null,null,null,null,null,null,null,null,"E.  PROGRAMS AND SERVICES FOR ELs AND THEIR FAMILIES (CONTINUED)",null,null,null,null,null,null,null,null,null,null,null,null,null,null,null,"E.  PROGRAMS AND SERVICES FOR ELs AND THEIR FAMILIES (CONTINUED)",null,null,null,null,null,null,null,null,null,null,null,null,null,null,null,"E.  PROGRAMS AND SERVICES FOR ELs AND THEIR FAMILIES (CONTINUED)",null,null,null,null,null,null,null,null,null,null,null,null,null,null,null,"E.  PROGRAMS AND SERVICES FOR ELs AND THEIR FAMILIES (CONTINUED)",null,null,null,null,null,null,null,null,null,null,null,null,null,null,null,"E.  PROGRAMS AND SERVICES FOR ELs AND THEIR FAMILIES (CONTINUED)",null,null,null,null,null,null,null,null,null,null,null,null,null,null,null,"E.  PROGRAMS AND SERVICES FOR ELs AND THEIR FAMILIES (CONTINUED)",null,null,null,null,null,null,null,null,null,null,null,null,null,null,null,"E.  PROGRAMS AND SERVICES FOR ELs AND THEIR FAMILIES (CONTINUED)",null,null,null,null,null,null,null,null,null,null,null,null,null,null,null,"E.  PROGRAMS AND SERVICES FOR ELs AND THEIR FAMILIES (CONTINUED)",null,null,null,null,null,null,null,null,null,null,null,null,null,null,null,"E.  PROGRAMS AND SERVICES FOR ELs AND THEIR FAMILIES (CONTINUED)",null,null,null,null,null,null,null,null,null,null,null,null,null,null,null,"E.  PROGRAMS AND SERVICES FOR ELs AND THEIR FAMILIES (CONTINUED)",null,null,null,null,null,null,null,null,null,null,null,null,null,null,null,"E.  PROGRAMS AND SERVICES FOR ELs AND THEIR FAMILIES (CONTINUED)",null,null,null,null,null,null,null,null,null,null,null,null,null,null,null,"E.  PROGRAMS AND SERVICES FOR ELs AND THEIR FAMILIES (CONTINUED)",null,null,null,null,null,null,null,null,null,null,null,null,null,null,null,"E.  PROGRAMS AND SERVICES FOR ELs AND THEIR FAMILIES (CONTINUED)",null,null,null,null,null,null,null,null,null,null,null,null,null,null,null,"E.  PROGRAMS AND SERVICES FOR ELs AND THEIR FAMILIES (CONTINUED)",null,null,null,null,null,null,null,null,null,null,null,null,null,null,null,"E.  PROGRAMS AND SERVICES FOR ELs AND THEIR FAMILIES (CONTINUED)",null,null,null,null,null,null,null,null,null,null,null,null,null,null,null,"E.  PROGRAMS AND SERVICES FOR ELs AND THEIR FAMILIES (CONTINUED)",null,null,null,null,null,null,null,null,null,null,null,null,null,null,null,"E.  PROGRAMS AND SERVICES FOR ELs AND THEIR FAMILIES (CONTINUED)",null,null,null,null,null,null,null,null,null,null,null,null,null,null,null,"E.  PROGRAMS AND SERVICES FOR ELs AND THEIR FAMILIES (CONTINUED)",null,null,null,null,null,null,null,null,null,null,null,null,null,null,null,"E.  PROGRAMS AND SERVICES FOR ELs AND THEIR FAMILIES (CONTINUED)",null,null,null,null,null,null,null,null,null,null,null,null,null,null,null,"E.  PROGRAMS AND SERVICES FOR ELs AND THEIR FAMILIES (CONTINUED)",null,null,null,null,null,null,null,null,null,null,null,null,null,null,null,"E.  PROGRAMS AND SERVICES FOR ELs AND THEIR FAMILIES (CONTINUED)",null,null,null,null,null,null,null,null,null,null,null,null,null,null,null,"E.  PROGRAMS AND SERVICES FOR ELs AND THEIR FAMILIES (CONTINUED)",null,null,null,null,null,null,null,null,null,null,null,null,null,null,null,"E.  PROGRAMS AND SERVICES FOR ELs AND THEIR FAMILIES (CONTINUED)",null,null,null,null,null,null,null,null,null,null,null,null,null,null,null,"E.  PROGRAMS AND SERVICES FOR ELs AND THEIR FAMILIES (CONTINUED)",null,null,null,null,null,null,null,null,null,null,null,null,null,null,null,"E.  PROGRAMS AND SERVICES FOR ELs AND THEIR FAMILIES (CONTINUED)",null,null,null,null,null,null,null,null,null,null,null,null,null,null,null,"E.  PROGRAMS AND SERVICES FOR ELs AND THEIR FAMILIES (CONTINUED)",null,null,null,null,null,null,null,null,null,null,null,null,null,null,null,"E.  PROGRAMS AND SERVICES FOR ELs AND THEIR FAMILIES (CONTINUED)",null,null,null,null,null,null,null,null,null,null,null,null,null,null,null,"E.  PROGRAMS AND SERVICES FOR ELs AND THEIR FAMILIES (CONTINUED)",null,null,null,null,null,null,null,null,null,null,null,null,null,null,null,"E.  PROGRAMS AND SERVICES FOR ELs AND THEIR FAMILIES (CONTINUED)",null,null,null,null,null,null,null,null,null,null,null,null,null,null,null,"E.  PROGRAMS AND SERVICES FOR ELs AND THEIR FAMILIES (CONTINUED)",null,null,null,null,null,null,null,null,null,null,null,null,null,null,null,"E.  PROGRAMS AND SERVICES FOR ELs AND THEIR FAMILIES (CONTINUED)",null,null,null,null,null,null,null,null,null,null,null,null,null,null,null,"E.  PROGRAMS AND SERVICES FOR ELs AND THEIR FAMILIES (CONTINUED)",null,null,null,null,null,null,null,null,null,null,null,null,null,null,null,"E.  PROGRAMS AND SERVICES FOR ELs AND THEIR FAMILIES (CONTINUED)",null,null,null,null,null,null,null,null,null,null,null,null,null,null,null,"E.  PROGRAMS AND SERVICES FOR ELs AND THEIR FAMILIES (CONTINUED)",null,null,null,null,null,null,null,null,null,null,null,null,null,null,null,"E.  PROGRAMS AND SERVICES FOR ELs AND THEIR FAMILIES (CONTINUED)",null,null,null,null,null,null,null,null,null,null,null,null,null,null,null,"E.  PROGRAMS AND SERVICES FOR ELs AND THEIR FAMILIES (CONTINUED)",null,null,null,null,null,null,null,null,null,null,null,null,null,null,null,"E.  PROGRAMS AND SERVICES FOR ELs AND THEIR FAMILIES (CONTINUED)",null,null,null,null,null,null,null,null,null,null,null,null,null,null,null,"E.  PROGRAMS AND SERVICES FOR ELs AND THEIR FAMILIES (CONTINUED)",null,null,null,null,null,null,null,null,null,null,null,null,null,null,null,"E.  PROGRAMS AND SERVICES FOR ELs AND THEIR FAMILIES (CONTINUED)",null,null,null,null,null,null,null,null,null,null,null,null,null,null,null,"E.  PROGRAMS AND SERVICES FOR ELs AND THEIR FAMILIES (CONTINUED)",null,null,null,null,null,null,null,null,null,null,null,null,null,null,null,"E.  PROGRAMS AND SERVICES FOR ELs AND THEIR FAMILIES (CONTINUED)",null,null,null,null,null,null,null,null,null,null,null,null,null,null,null,"E.  PROGRAMS AND SERVICES FOR ELs AND THEIR FAMILIES (CONTINUED)",null,null,null,null,null,null,null,null,null,null,null,null,null,null,null,"E.  PROGRAMS AND SERVICES FOR ELs AND THEIR FAMILIES (CONTINUED)",null,null,null,null,null,null,null,null,null,null,null,null,null,null,null,"E.  PROGRAMS AND SERVICES FOR ELs AND THEIR FAMILIES (CONTINUED)",null,null,null,null,null,null,null,null,null,null,null,null,null,null,null,"E.  PROGRAMS AND SERVICES FOR ELs AND THEIR FAMILIES (CONTINUED)",null,null,null,null,null,null,null,null,null,null,null,null,null,null,null,"E.  PROGRAMS AND SERVICES FOR ELs AND THEIR FAMILIES (CONTINUED)",null,null,null,null,null,null,null,null,null,null,null,null,null,null,null,"E.  PROGRAMS AND SERVICES FOR ELs AND THEIR FAMILIES (CONTINUED)",null,null,null,null,null,null,null,null,null,null,null,null,null,null,null,"E.  PROGRAMS AND SERVICES FOR ELs AND THEIR FAMILIES (CONTINUED)",null,null,null,null,null,null,null,null,null,null,null,null,null,null,null,"E.  PROGRAMS AND SERVICES FOR ELs AND THEIR FAMILIES (CONTINUED)",null,null,null,null,null,null,null,null,null,null,null,null,null,null,null,"E.  PROGRAMS AND SERVICES FOR ELs AND THEIR FAMILIES (CONTINUED)",null,null,null,null,null,null,null,null,null,null,null,null,null,null,null,"E.  PROGRAMS AND SERVICES FOR ELs AND THEIR FAMILIES (CONTINUED)",null,null,null,null,null,null,null,null,null,null,null,null,null,null,null,"E.  PROGRAMS AND SERVICES FOR ELs AND THEIR FAMILIES (CONTINUED)",null,null,null,null,null,null,null,null,null,null,null,null,null,null,null,"E.  PROGRAMS AND SERVICES FOR ELs AND THEIR FAMILIES (CONTINUED)",null,null,null,null,null,null,null,null,null,null,null,null,null,null,null,"E.  PROGRAMS AND SERVICES FOR ELs AND THEIR FAMILIES (CONTINUED)",null,null,null,null,null,null,null,null,null,null,null,null,null,null,null,"E.  PROGRAMS AND SERVICES FOR ELs AND THEIR FAMILIES (CONTINUED)",null,null,null,null,null,null,null,null,null,null,null,null,null,null,null,"E.  PROGRAMS AND SERVICES FOR ELs AND THEIR FAMILIES (CONTINUED)",null,null,null,null,null,null,null,null,null,null,null,null,null,null,null,"E.  PROGRAMS AND SERVICES FOR ELs AND THEIR FAMILIES (CONTINUED)",null,null,null,null,null,null,null,null,null,null,null,null,null,null,null,"E.  PROGRAMS AND SERVICES FOR ELs AND THEIR FAMILIES (CONTINUED)",null,null,null,null,null,null,null,null,null,null,null,null,null,null,null,"E.  PROGRAMS AND SERVICES FOR ELs AND THEIR FAMILIES (CONTINUED)",null,null,null,null,null,null,null,null,null,null,null,null,null,null,null,"E.  PROGRAMS AND SERVICES FOR ELs AND THEIR FAMILIES (CONTINUED)",null,null,null,null,null,null,null,null,null,null,null,null,null,null,null,"E.  PROGRAMS AND SERVICES FOR ELs AND THEIR FAMILIES (CONTINUED)",null,null,null,null,null,null,null,null,null,null,null,null,null,null,null,"E.  PROGRAMS AND SERVICES FOR ELs AND THEIR FAMILIES (CONTINUED)",null,null,null,null,null,null,null,null,null,null,null,null,null,null,null,"E.  PROGRAMS AND SERVICES FOR ELs AND THEIR FAMILIES (CONTINUED)",null,null,null,null,null,null,null,null,null,null,null,null,null,null,null,"E.  PROGRAMS AND SERVICES FOR ELs AND THEIR FAMILIES (CONTINUED)",null,null,null,null,null,null,null,null,null,null,null,null,null,null,null,"E.  PROGRAMS AND SERVICES FOR ELs AND THEIR FAMILIES (CONTINUED)",null,null,null,null,null,null,null,null,null,null,null,null,null,null,null,"E.  PROGRAMS AND SERVICES FOR ELs AND THEIR FAMILIES (CONTINUED)",null,null,null,null,null,null,null,null,null,null,null,null,null,null,null,"E.  PROGRAMS AND SERVICES FOR ELs AND THEIR FAMILIES (CONTINUED)",null,null,null,null,null,null,null,null,null,null,null,null,null,null,null,"E.  PROGRAMS AND SERVICES FOR ELs AND THEIR FAMILIES (CONTINUED)",null,null,null,null,null,null,null,null,null,null,null,null,null,null,null,"E.  PROGRAMS AND SERVICES FOR ELs AND THEIR FAMILIES (CONTINUED)",null,null,null,null,null,null,null,null,null,null,null,null,null,null,null,"E.  PROGRAMS AND SERVICES FOR ELs AND THEIR FAMILIES (CONTINUED)",null,null,null,null,null,null,null,null,null,null,null,null,null,null,null,"E.  PROGRAMS AND SERVICES FOR ELs AND THEIR FAMILIES (CONTINUED)",null,null,null,null,null,null,null,null,null,null,null,null,null,null,null,"E.  PROGRAMS AND SERVICES FOR ELs AND THEIR FAMILIES (CONTINUED)",null,null,null,null,null,null,null,null,null,null,null,null,null,null,null,"E.  PROGRAMS AND SERVICES FOR ELs AND THEIR FAMILIES (CONTINUED)",null,null,null,null,null,null,null,null,null,null,null,null,null,null,null,"E.  PROGRAMS AND SERVICES FOR ELs AND THEIR FAMILIES (CONTINUED)",null,null,null,null,null,null,null,null,null,null,null,null,null,null,null,"E.  PROGRAMS AND SERVICES FOR ELs AND THEIR FAMILIES (CONTINUED)",null,null,null,null,null,null,null,null,null,null,null,null,null,null,null,"E.  PROGRAMS AND SERVICES FOR ELs AND THEIR FAMILIES (CONTINUED)",null,null,null,null,null,null,null,null,null,null,null,null,null,null,null,"E.  PROGRAMS AND SERVICES FOR ELs AND THEIR FAMILIES (CONTINUED)",null,null,null,null,null,null,null,null,null,null,null,null,null,null,null,"E.  PROGRAMS AND SERVICES FOR ELs AND THEIR FAMILIES (CONTINUED)",null,null,null,null,null,null,null,null,null,null,null,null,null,null,null,"E.  PROGRAMS AND SERVICES FOR ELs AND THEIR FAMILIES (CONTINUED)",null,null,null,null,null,null,null,null,null,null,null,null,null,null,null,"E.  PROGRAMS AND SERVICES FOR ELs AND THEIR FAMILIES (CONTINUED)",null,null,null,null,null,null,null,null,null,null,null,null,null,null,null,"E.  PROGRAMS AND SERVICES FOR ELs AND THEIR FAMILIES (CONTINUED)",null,null,null,null,null,null,null,null,null,null,null,null,null,null,null,"E.  PROGRAMS AND SERVICES FOR ELs AND THEIR FAMILIES (CONTINUED)",null,null,null,null,null,null,null,null,null,null,null,null,null,null,null,"E.  PROGRAMS AND SERVICES FOR ELs AND THEIR FAMILIES (CONTINUED)",null,null,null,null,null,null,null,null,null,null,null,null,null,null,null,"E.  PROGRAMS AND SERVICES FOR ELs AND THEIR FAMILIES (CONTINUED)",null,null,null,null,null,null,null,null,null,null,null,null,null,null,null,"E.  PROGRAMS AND SERVICES FOR ELs AND THEIR FAMILIES (CONTINUED)",null,null,null,null,null,null,null,null,null,null,null,null,null,null,null,"E.  PROGRAMS AND SERVICES FOR ELs AND THEIR FAMILIES (CONTINUED)",null,null,null,null,null,null,null,null,null,null,null,null,null,null,null,"E.  PROGRAMS AND SERVICES FOR ELs AND THEIR FAMILIES (CONTINUED)",null,null,null,null,null,null,null,null,null,null,null,null,null,null,null,"E.  PROGRAMS AND SERVICES FOR ELs AND THEIR FAMILIES (CONTINUED)",null,null,null,null,null,null,null,null,null,null,null,null,null,null,null,"E.  PROGRAMS AND SERVICES FOR ELs AND THEIR FAMILIES (CONTINUED)",null,null,null,null,null,null,null,null,null,null,null,null,null,null,null,"E.  PROGRAMS AND SERVICES FOR ELs AND THEIR FAMILIES (CONTINUED)",null,null,null,null,null,null,null,null,null,null,null,null,null,null,null,"E.  PROGRAMS AND SERVICES FOR ELs AND THEIR FAMILIES (CONTINUED)",null,null,null,null,null,null,null,null,null,null,null,null,null,null,null,"E.  PROGRAMS AND SERVICES FOR ELs AND THEIR FAMILIES (CONTINUED)",null,null,null,null,null,null,null,null,null,null,null,null,null,null,null,"E.  PROGRAMS AND SERVICES FOR ELs AND THEIR FAMILIES (CONTINUED)",null,null,null,null,null,null,null,null,null,null,null,null,null,null,null,"E.  PROGRAMS AND SERVICES FOR ELs AND THEIR FAMILIES (CONTINUED)",null,null,null,null,null,null,null,null,null,null,null,null,null,null,null,"E.  PROGRAMS AND SERVICES FOR ELs AND THEIR FAMILIES (CONTINUED)",null,null,null,null,null,null,null,null,null,null,null,null,null,null,null,"E.  PROGRAMS AND SERVICES FOR ELs AND THEIR FAMILIES (CONTINUED)",null,null,null,null,null,null,null,null,null,null,null,null,null,null,null,"E.  PROGRAMS AND SERVICES FOR ELs AND THEIR FAMILIES (CONTINUED)",null,null,null,null,null,null,null,null,null,null,null,null,null,null,null,"E.  PROGRAMS AND SERVICES FOR ELs AND THEIR FAMILIES (CONTINUED)",null,null,null,null,null,null,null,null,null,null,null,null,null,null,null,"E.  PROGRAMS AND SERVICES FOR ELs AND THEIR FAMILIES (CONTINUED)",null,null,null,null,null,null,null,null,null,null,null,null,null,null,null,"E.  PROGRAMS AND SERVICES FOR ELs AND THEIR FAMILIES (CONTINUED)",null,null,null,null,null,null,null,null,null,null,null,null,null,null,null,"E.  PROGRAMS AND SERVICES FOR ELs AND THEIR FAMILIES (CONTINUED)",null,null,null,null,null,null,null,null,null,null,null,null,null,null,null,"E.  PROGRAMS AND SERVICES FOR ELs AND THEIR FAMILIES (CONTINUED)",null,null,null,null,null,null,null,null,null,null,null,null,null,null,null,"E.  PROGRAMS AND SERVICES FOR ELs AND THEIR FAMILIES (CONTINUED)",null,null,null,null,null,null,null,null,null,null,null,null,null,null,null,"E.  PROGRAMS AND SERVICES FOR ELs AND THEIR FAMILIES (CONTINUED)",null,null,null,null,null,null,null,null,null,null,null,null,null,null,null,"E.  PROGRAMS AND SERVICES FOR ELs AND THEIR FAMILIES (CONTINUED)",null,null,null,null,null,null,null,null,null,null,null,null,null,null,null,"E.  PROGRAMS AND SERVICES FOR ELs AND THEIR FAMILIES (CONTINUED)",null,null,null,null,null,null,null,null,null,null,null,null,null,null,null,"E.  PROGRAMS AND SERVICES FOR ELs AND THEIR FAMILIES (CONTINUED)",null,null,null,null,null,null,null,null,null,null,null,null,null,null,null,"E.  PROGRAMS AND SERVICES FOR ELs AND THEIR FAMILIES (CONTINUED)",null,null,null,null,null,null,null,null,null,null,null,null,null,null,null,"E.  PROGRAMS AND SERVICES FOR ELs AND THEIR FAMILIES (CONTINUED)",null,null,null,null,null,null,null,null,null,null,null,null,null,null,null,"E.  PROGRAMS AND SERVICES FOR ELs AND THEIR FAMILIES (CONTINUED)",null,null,null,null,null,null,null,null,null,null,null,null,null,null,null,"E.  PROGRAMS AND SERVICES FOR ELs AND THEIR FAMILIES (CONTINUED)",null,null,null,null,null,null,null,null,null,null,null,null,null,null,null,"E.  PROGRAMS AND SERVICES FOR ELs AND THEIR FAMILIES (CONTINUED)",null,null,null,null,null,null,null,null,null,null,null,null,null,null,null,"E.  PROGRAMS AND SERVICES FOR ELs AND THEIR FAMILIES (CONTINUED)",null,null,null,null,null,null,null,null,null,null,null,null,null,null,null,"E.  PROGRAMS AND SERVICES FOR ELs AND THEIR FAMILIES (CONTINUED)",null,null,null,null,null,null,null,null,null,null,null,null,null,null,null,"E.  PROGRAMS AND SERVICES FOR ELs AND THEIR FAMILIES (CONTINUED)",null,null,null,null,null,null,null,null,null,null,null,null,null,null,null,"E.  PROGRAMS AND SERVICES FOR ELs AND THEIR FAMILIES (CONTINUED)",null,null,null,null,null,null,null,null,null,null,null,null,null,null,null,"E.  PROGRAMS AND SERVICES FOR ELs AND THEIR FAMILIES (CONTINUED)",null,null,null,null,null,null,null,null,null,null,null,null,null,null,null,"E.  PROGRAMS AND SERVICES FOR ELs AND THEIR FAMILIES (CONTINUED)",null,null,null,null,null,null,null,null,null,null,null,null,null,null,null,"E.  PROGRAMS AND SERVICES FOR ELs AND THEIR FAMILIES (CONTINUED)",null,null,null,null,null,null,null,null,null,null,null,null,null,null,null,"E.  PROGRAMS AND SERVICES FOR ELs AND THEIR FAMILIES (CONTINUED)",null,null,null,null,null,null,null,null,null,null,null,null,null,null,null,"E.  PROGRAMS AND SERVICES FOR ELs AND THEIR FAMILIES (CONTINUED)",null,null,null,null,null,null,null,null,null,null,null,null,null,null,null,"E.  PROGRAMS AND SERVICES FOR ELs AND THEIR FAMILIES (CONTINUED)",null,null,null,null,null,null,null,null,null,null,null,null,null,null,null,"E.  PROGRAMS AND SERVICES FOR ELs AND THEIR FAMILIES (CONTINUED)",null,null,null,null,null,null,null,null,null,null,null,null,null,null,null,"E.  PROGRAMS AND SERVICES FOR ELs AND THEIR FAMILIES (CONTINUED)",null,null,null,null,null,null,null,null,null,null,null,null,null,null,null,"E.  PROGRAMS AND SERVICES FOR ELs AND THEIR FAMILIES (CONTINUED)",null,null,null,null,null,null,null,null,null,null,null,null,null,null,null,"E.  PROGRAMS AND SERVICES FOR ELs AND THEIR FAMILIES (CONTINUED)",null,null,null,null,null,null,null,null,null,null,null,null,null,null,null,"E.  PROGRAMS AND SERVICES FOR ELs AND THEIR FAMILIES (CONTINUED)",null,null,null,null,null,null,null,null,null,null,null,null,null,null,null,"E.  PROGRAMS AND SERVICES FOR ELs AND THEIR FAMILIES (CONTINUED)",null,null,null,null,null,null,null,null,null,null,null,null,null,null,null,"E.  PROGRAMS AND SERVICES FOR ELs AND THEIR FAMILIES (CONTINUED)",null,null,null,null,null,null,null,null,null,null,null,null,null,null,null,"E.  PROGRAMS AND SERVICES FOR ELs AND THEIR FAMILIES (CONTINUED)",null,null,null,null,null,null,null,null,null,null,null,null,null,null,null,"E.  PROGRAMS AND SERVICES FOR ELs AND THEIR FAMILIES (CONTINUED)",null,null,null,null,null,null,null,null,null,null,null,null,null,null,null,"E.  PROGRAMS AND SERVICES FOR ELs AND THEIR FAMILIES (CONTINUED)",null,null,null,null,null,null,null,null,null,null,null,null,null,null,null,"E.  PROGRAMS AND SERVICES FOR ELs AND THEIR FAMILIES (CONTINUED)",null,null,null,null,null,null,null,null,null,null,null,null,null,null,null,"E.  PROGRAMS AND SERVICES FOR ELs AND THEIR FAMILIES (CONTINUED)",null,null,null,null,null,null,null,null,null,null,null,null,null,null,null,"E.  PROGRAMS AND SERVICES FOR ELs AND THEIR FAMILIES (CONTINUED)",null,null,null,null,null,null,null,null,null,null,null,null,null,null,null,"E.  PROGRAMS AND SERVICES FOR ELs AND THEIR FAMILIES (CONTINUED)",null,null,null,null,null,null,null,null,null,null,null,null,null,null,null,"E.  PROGRAMS AND SERVICES FOR ELs AND THEIR FAMILIES (CONTINUED)",null,null,null,null,null,null,null,null,null,null,null,null,null,null,null,"E.  PROGRAMS AND SERVICES FOR ELs AND THEIR FAMILIES (CONTINUED)",null,null,null,null,null,null,null,null,null,null,null,null,null,null,null,"E.  PROGRAMS AND SERVICES FOR ELs AND THEIR FAMILIES (CONTINUED)",null,null,null,null,null,null,null,null,null,null,null,null,null,null,null,"E.  PROGRAMS AND SERVICES FOR ELs AND THEIR FAMILIES (CONTINUED)",null,null,null,null,null,null,null,null,null,null,null,null,null,null,null,"E.  PROGRAMS AND SERVICES FOR ELs AND THEIR FAMILIES (CONTINUED)",null,null,null,null,null,null,null,null,null,null,null,null,null,null,null,"E.  PROGRAMS AND SERVICES FOR ELs AND THEIR FAMILIES (CONTINUED)",null,null,null,null,null,null,null,null,null,null,null,null,null,null,null,"E.  PROGRAMS AND SERVICES FOR ELs AND THEIR FAMILIES (CONTINUED)",null,null,null,null,null,null,null,null,null,null,null,null,null,null,null,"E.  PROGRAMS AND SERVICES FOR ELs AND THEIR FAMILIES (CONTINUED)",null,null,null,null,null,null,null,null,null,null,null,null,null,null,null,"E.  PROGRAMS AND SERVICES FOR ELs AND THEIR FAMILIES (CONTINUED)",null,null,null,null,null,null,null,null,null,null,null,null,null,null,null,"E.  PROGRAMS AND SERVICES FOR ELs AND THEIR FAMILIES (CONTINUED)",null,null,null,null,null,null,null,null,null,null,null,null,null,null,null,"E.  PROGRAMS AND SERVICES FOR ELs AND THEIR FAMILIES (CONTINUED)",null,null,null,null,null,null,null,null,null,null,null,null,null,null,null,"E.  PROGRAMS AND SERVICES FOR ELs AND THEIR FAMILIES (CONTINUED)",null,null,null,null,null,null,null,null,null,null,null,null,null,null,null,"E.  PROGRAMS AND SERVICES FOR ELs AND THEIR FAMILIES (CONTINUED)",null,null,null,null,null,null,null,null,null,null,null,null,null,null,null,"E.  PROGRAMS AND SERVICES FOR ELs AND THEIR FAMILIES (CONTINUED)",null,null,null,null,null,null,null,null,null,null,null,null,null,null,null,"E.  PROGRAMS AND SERVICES FOR ELs AND THEIR FAMILIES (CONTINUED)",null,null,null,null,null,null,null,null,null,null,null,null,null,null,null,"E.  PROGRAMS AND SERVICES FOR ELs AND THEIR FAMILIES (CONTINUED)",null,null,null,null,null,null,null,null,null,null,null,null,null,null,null,"E.  PROGRAMS AND SERVICES FOR ELs AND THEIR FAMILIES (CONTINUED)",null,null,null,null,null,null,null,null,null,null,null,null,null,null,null,"E.  PROGRAMS AND SERVICES FOR ELs AND THEIR FAMILIES (CONTINUED)",null,null,null,null,null,null,null,null,null,null,null,null,null,null,null,"E.  PROGRAMS AND SERVICES FOR ELs AND THEIR FAMILIES (CONTINUED)",null,null,null,null,null,null,null,null,null,null,null,null,null,null,null,"E.  PROGRAMS AND SERVICES FOR ELs AND THEIR FAMILIES (CONTINUED)",null,null,null,null,null,null,null,null,null,null,null,null,null,null,null,"E.  PROGRAMS AND SERVICES FOR ELs AND THEIR FAMILIES (CONTINUED)",null,null,null,null,null,null,null,null,null,null,null,null,null,null,null,"E.  PROGRAMS AND SERVICES FOR ELs AND THEIR FAMILIES (CONTINUED)",null,null,null,null,null,null,null,null,null,null,null,null,null,null,null,"E.  PROGRAMS AND SERVICES FOR ELs AND THEIR FAMILIES (CONTINUED)",null,null,null,null,null,null,null,null,null,null,null,null,null,null,null,"E.  PROGRAMS AND SERVICES FOR ELs AND THEIR FAMILIES (CONTINUED)",null,null,null,null,null,null,null,null,null,null,null,null,null,null,null,"E.  PROGRAMS AND SERVICES FOR ELs AND THEIR FAMILIES (CONTINUED)",null,null,null,null,null,null,null,null,null,null,null,null,null,null,null,"E.  PROGRAMS AND SERVICES FOR ELs AND THEIR FAMILIES (CONTINUED)",null,null,null,null,null,null,null,null,null,null,null,null,null,null,null,"E.  PROGRAMS AND SERVICES FOR ELs AND THEIR FAMILIES (CONTINUED)",null,null,null,null,null,null,null,null,null,null,null,null,null,null,null,"E.  PROGRAMS AND SERVICES FOR ELs AND THEIR FAMILIES (CONTINUED)",null,null,null,null,null,null,null,null,null,null,null,null,null,null,null,"E.  PROGRAMS AND SERVICES FOR ELs AND THEIR FAMILIES (CONTINUED)",null,null,null,null,null,null,null,null,null,null,null,null,null,null,null,"E.  PROGRAMS AND SERVICES FOR ELs AND THEIR FAMILIES (CONTINUED)",null,null,null,null,null,null,null,null,null,null,null,null,null,null,null,"E.  PROGRAMS AND SERVICES FOR ELs AND THEIR FAMILIES (CONTINUED)",null,null,null,null,null,null,null,null,null,null,null,null,null,null,null,"E.  PROGRAMS AND SERVICES FOR ELs AND THEIR FAMILIES (CONTINUED)",null,null,null,null,null,null,null,null,null,null,null,null,null,null,null,"E.  PROGRAMS AND SERVICES FOR ELs AND THEIR FAMILIES (CONTINUED)",null,null,null,null,null,null,null,null,null,null,null,null,null,null,null,"E.  PROGRAMS AND SERVICES FOR ELs AND THEIR FAMILIES (CONTINUED)",null,null,null,null,null,null,null,null,null,null,null,null,null,null,null,"E.  PROGRAMS AND SERVICES FOR ELs AND THEIR FAMILIES (CONTINUED)",null,null,null,null,null,null,null,null,null,null,null,null,null,null,null,"E.  PROGRAMS AND SERVICES FOR ELs AND THEIR FAMILIES (CONTINUED)",null,null,null,null,null,null,null,null,null,null,null,null,null,null,null,"E.  PROGRAMS AND SERVICES FOR ELs AND THEIR FAMILIES (CONTINUED)",null,null,null,null,null,null,null,null,null,null,null,null,null,null,null,"E.  PROGRAMS AND SERVICES FOR ELs AND THEIR FAMILIES (CONTINUED)",null,null,null,null,null,null,null,null,null,null,null,null,null,null,null,"E.  PROGRAMS AND SERVICES FOR ELs AND THEIR FAMILIES (CONTINUED)",null,null,null,null,null,null,null,null,null,null,null,null,null,null,null,"E.  PROGRAMS AND SERVICES FOR ELs AND THEIR FAMILIES (CONTINUED)",null,null,null,null,null,null,null,null,null,null,null,null,null,null,null,"E.  PROGRAMS AND SERVICES FOR ELs AND THEIR FAMILIES (CONTINUED)",null,null,null,null,null,null,null,null,null,null,null,null,null,null,null,"E.  PROGRAMS AND SERVICES FOR ELs AND THEIR FAMILIES (CONTINUED)",null,null,null,null,null,null,null,null,null,null,null,null,null,null,null,"E.  PROGRAMS AND SERVICES FOR ELs AND THEIR FAMILIES (CONTINUED)",null,null,null,null,null,null,null,null,null,null,null,null,null,null,null,"E.  PROGRAMS AND SERVICES FOR ELs AND THEIR FAMILIES (CONTINUED)",null,null,null,null,null,null,null,null,null,null,null,null,null,null,null,"E.  PROGRAMS AND SERVICES FOR ELs AND THEIR FAMILIES (CONTINUED)",null,null,null,null,null,null,null,null,null,null,null,null,null,null,null,"E.  PROGRAMS AND SERVICES FOR ELs AND THEIR FAMILIES (CONTINUED)",null,null,null,null,null,null,null,null,null,null,null,null,null,null,null,"E.  PROGRAMS AND SERVICES FOR ELs AND THEIR FAMILIES (CONTINUED)",null,null,null,null,null,null,null,null,null,null,null,null,null,null,null,"E.  PROGRAMS AND SERVICES FOR ELs AND THEIR FAMILIES (CONTINUED)",null,null,null,null,null,null,null,null,null,null,null,null,null,null,null,"E.  PROGRAMS AND SERVICES FOR ELs AND THEIR FAMILIES (CONTINUED)",null,null,null,null,null,null,null,null,null,null,null,null,null,null,null,"E.  PROGRAMS AND SERVICES FOR ELs AND THEIR FAMILIES (CONTINUED)",null,null,null,null,null,null,null,null,null,null,null,null,null,null,null,"E.  PROGRAMS AND SERVICES FOR ELs AND THEIR FAMILIES (CONTINUED)",null,null,null,null,null,null,null,null,null,null,null,null,null,null,null,"E.  PROGRAMS AND SERVICES FOR ELs AND THEIR FAMILIES (CONTINUED)",null,null,null,null,null,null,null,null,null,null,null,null,null,null,null,"E.  PROGRAMS AND SERVICES FOR ELs AND THEIR FAMILIES (CONTINUED)",null,null,null,null,null,null,null,null,null,null,null,null,null,null,null,"E.  PROGRAMS AND SERVICES FOR ELs AND THEIR FAMILIES (CONTINUED)",null,null,null,null,null,null,null,null,null,null,null,null,null,null,null,"E.  PROGRAMS AND SERVICES FOR ELs AND THEIR FAMILIES (CONTINUED)",null,null,null,null,null,null,null,null,null,null,null,null,null,null,null,"E.  PROGRAMS AND SERVICES FOR ELs AND THEIR FAMILIES (CONTINUED)",null,null,null,null,null,null,null,null,null,null,null,null,null,null,null,"E.  PROGRAMS AND SERVICES FOR ELs AND THEIR FAMILIES (CONTINUED)",null,null,null,null,null,null,null,null,null,null,null,null,null,null,null,"E.  PROGRAMS AND SERVICES FOR ELs AND THEIR FAMILIES (CONTINUED)",null,null,null,null,null,null,null,null,null,null,null,null,null,null,null,"E.  PROGRAMS AND SERVICES FOR ELs AND THEIR FAMILIES (CONTINUED)",null,null,null,null,null,null,null,null,null,null,null,null,null,null,null,"E.  PROGRAMS AND SERVICES FOR ELs AND THEIR FAMILIES (CONTINUED)",null,null,null,null,null,null,null,null,null,null,null,null,null,null,null,"E.  PROGRAMS AND SERVICES FOR ELs AND THEIR FAMILIES (CONTINUED)",null,null,null,null,null,null,null,null,null,null,null,null,null,null,null,"E.  PROGRAMS AND SERVICES FOR ELs AND THEIR FAMILIES (CONTINUED)",null,null,null,null,null,null,null,null,null,null,null,null,null,null,null,"E.  PROGRAMS AND SERVICES FOR ELs AND THEIR FAMILIES (CONTINUED)",null,null,null,null,null,null,null,null,null,null,null,null,null,null,null,"E.  PROGRAMS AND SERVICES FOR ELs AND THEIR FAMILIES (CONTINUED)",null,null,null,null,null,null,null,null,null,null,null,null,null,null,null,"E.  PROGRAMS AND SERVICES FOR ELs AND THEIR FAMILIES (CONTINUED)",null,null,null,null,null,null,null,null,null,null,null,null,null,null,null,"E.  PROGRAMS AND SERVICES FOR ELs AND THEIR FAMILIES (CONTINUED)",null,null,null,null,null,null,null,null,null,null,null,null,null,null,null,"E.  PROGRAMS AND SERVICES FOR ELs AND THEIR FAMILIES (CONTINUED)",null,null,null,null,null,null,null,null,null,null,null,null,null,null,null,"E.  PROGRAMS AND SERVICES FOR ELs AND THEIR FAMILIES (CONTINUED)",null,null,null,null,null,null,null,null,null,null,null,null,null,null,null,"E.  PROGRAMS AND SERVICES FOR ELs AND THEIR FAMILIES (CONTINUED)",null,null,null,null,null,null,null,null,null,null,null,null,null,null,null,"E.  PROGRAMS AND SERVICES FOR ELs AND THEIR FAMILIES (CONTINUED)",null,null,null,null,null,null,null,null,null,null,null,null,null,null,null,"E.  PROGRAMS AND SERVICES FOR ELs AND THEIR FAMILIES (CONTINUED)",null,null,null,null,null,null,null,null,null,null,null,null,null,null,null,"E.  PROGRAMS AND SERVICES FOR ELs AND THEIR FAMILIES (CONTINUED)",null,null,null,null,null,null,null,null,null,null,null,null,null,null,null,"E.  PROGRAMS AND SERVICES FOR ELs AND THEIR FAMILIES (CONTINUED)",null,null,null,null,null,null,null,null,null,null,null,null,null,null,null,"E.  PROGRAMS AND SERVICES FOR ELs AND THEIR FAMILIES (CONTINUED)",null,null,null,null,null,null,null,null,null,null,null,null,null,null,null,"E.  PROGRAMS AND SERVICES FOR ELs AND THEIR FAMILIES (CONTINUED)",null,null,null,null,null,null,null,null,null,null,null,null,null,null,null,"E.  PROGRAMS AND SERVICES FOR ELs AND THEIR FAMILIES (CONTINUED)",null,null,null,null,null,null,null,null,null,null,null,null,null,null,null,"E.  PROGRAMS AND SERVICES FOR ELs AND THEIR FAMILIES (CONTINUED)",null,null,null,null,null,null,null,null,null,null,null,null,null,null,null,"E.  PROGRAMS AND SERVICES FOR ELs AND THEIR FAMILIES (CONTINUED)",null,null,null,null,null,null,null,null,null,null,null,null,null,null,null,"E.  PROGRAMS AND SERVICES FOR ELs AND THEIR FAMILIES (CONTINUED)",null,null,null,null,null,null,null,null,null,null,null,null,null,null,null,"E.  PROGRAMS AND SERVICES FOR ELs AND THEIR FAMILIES (CONTINUED)",null,null,null,null,null,null,null,null,null,null,null,null,null,null,null,"E.  PROGRAMS AND SERVICES FOR ELs AND THEIR FAMILIES (CONTINUED)",null,null,null,null,null,null,null,null,null,null,null,null,null,null,null,"E.  PROGRAMS AND SERVICES FOR ELs AND THEIR FAMILIES (CONTINUED)",null,null,null,null,null,null,null,null,null,null,null,null,null,null,null,"E.  PROGRAMS AND SERVICES FOR ELs AND THEIR FAMILIES (CONTINUED)",null,null,null,null,null,null,null,null,null,null,null,null,null,null,null,"E.  PROGRAMS AND SERVICES FOR ELs AND THEIR FAMILIES (CONTINUED)",null,null,null,null,null,null,null,null,null,null,null,null,null,null,null,"E.  PROGRAMS AND SERVICES FOR ELs AND THEIR FAMILIES (CONTINUED)",null,null,null,null,null,null,null,null,null,null,null,null,null,null,null,"E.  PROGRAMS AND SERVICES FOR ELs AND THEIR FAMILIES (CONTINUED)",null,null,null,null,null,null,null,null,null,null,null,null,null,null,null,"E.  PROGRAMS AND SERVICES FOR ELs AND THEIR FAMILIES (CONTINUED)",null,null,null,null,null,null,null,null,null,null,null,null,null,null,null,"E.  PROGRAMS AND SERVICES FOR ELs AND THEIR FAMILIES (CONTINUED)",null,null,null,null,null,null,null,null,null,null,null,null,null,null,null,"E.  PROGRAMS AND SERVICES FOR ELs AND THEIR FAMILIES (CONTINUED)",null,null,null,null,null,null,null,null,null,null,null,null,null,null,null,"E.  PROGRAMS AND SERVICES FOR ELs AND THEIR FAMILIES (CONTINUED)",null,null,null,null,null,null,null,null,null,null,null,null,null,null,null,"E.  PROGRAMS AND SERVICES FOR ELs AND THEIR FAMILIES (CONTINUED)",null,null,null,null,null,null,null,null,null,null,null,null,null,null,null,"E.  PROGRAMS AND SERVICES FOR ELs AND THEIR FAMILIES (CONTINUED)",null,null,null,null,null,null,null,null,null,null,null,null,null,null,null,"E.  PROGRAMS AND SERVICES FOR ELs AND THEIR FAMILIES (CONTINUED)",null,null,null,null,null,null,null,null,null,null,null,null,null,null,null,"E.  PROGRAMS AND SERVICES FOR ELs AND THEIR FAMILIES (CONTINUED)",null,null,null,null,null,null,null,null,null,null,null,null,null,null,null,"E.  PROGRAMS AND SERVICES FOR ELs AND THEIR FAMILIES (CONTINUED)",null,null,null,null,null,null,null,null,null,null,null,null,null,null,null,"E.  PROGRAMS AND SERVICES FOR ELs AND THEIR FAMILIES (CONTINUED)",null,null,null,null,null,null,null,null,null,null,null,null,null,null,null,"E.  PROGRAMS AND SERVICES FOR ELs AND THEIR FAMILIES (CONTINUED)",null,null,null,null,null,null,null,null,null,null,null,null,null,null,null,"E.  PROGRAMS AND SERVICES FOR ELs AND THEIR FAMILIES (CONTINUED)",null,null,null,null,null,null,null,null,null,null,null,null,null,null,null,"E.  PROGRAMS AND SERVICES FOR ELs AND THEIR FAMILIES (CONTINUED)",null,null,null,null,null,null,null,null,null,null,null,null,null,null,null,"E.  PROGRAMS AND SERVICES FOR ELs AND THEIR FAMILIES (CONTINUED)",null,null,null,null,null,null,null,null,null,null,null,null,null,null,null,"E.  PROGRAMS AND SERVICES FOR ELs AND THEIR FAMILIES (CONTINUED)",null,null,null,null,null,null,null,null,null,null,null,null,null,null,null,"E.  PROGRAMS AND SERVICES FOR ELs AND THEIR FAMILIES (CONTINUED)",null,null,null,null,null,null,null,null,null,null,null,null,null,null,null,"E.  PROGRAMS AND SERVICES FOR ELs AND THEIR FAMILIES (CONTINUED)",null,null,null,null,null,null,null,null,null,null,null,null,null,null,null,"E.  PROGRAMS AND SERVICES FOR ELs AND THEIR FAMILIES (CONTINUED)",null,null,null,null,null,null,null,null,null,null,null,null,null,null,null,"E.  PROGRAMS AND SERVICES FOR ELs AND THEIR FAMILIES (CONTINUED)",null,null,null,null,null,null,null,null,null,null,null,null,null,null,null,"E.  PROGRAMS AND SERVICES FOR ELs AND THEIR FAMILIES (CONTINUED)",null,null,null,null,null,null,null,null,null,null,null,null,null,null,null,"E.  PROGRAMS AND SERVICES FOR ELs AND THEIR FAMILIES (CONTINUED)",null,null,null,null,null,null,null,null,null,null,null,null,null,null,null,"E.  PROGRAMS AND SERVICES FOR ELs AND THEIR FAMILIES (CONTINUED)",null,null,null,null,null,null,null,null,null,null,null,null,null,null,null,"E.  PROGRAMS AND SERVICES FOR ELs AND THEIR FAMILIES (CONTINUED)",null,null,null,null,null,null,null,null,null,null,null,null,null,null,null,"E.  PROGRAMS AND SERVICES FOR ELs AND THEIR FAMILIES (CONTINUED)",null,null,null,null,null,null,null,null,null,null,null,null,null,null,null,"E.  PROGRAMS AND SERVICES FOR ELs AND THEIR FAMILIES (CONTINUED)",null,null,null,null,null,null,null,null,null,null,null,null,null,null,null,"E.  PROGRAMS AND SERVICES FOR ELs AND THEIR FAMILIES (CONTINUED)",null,null,null,null,null,null,null,null,null,null,null,null,null,null,null,"E.  PROGRAMS AND SERVICES FOR ELs AND THEIR FAMILIES (CONTINUED)",null,null,null,null,null,null,null,null,null,null,null,null,null,null,null,"E.  PROGRAMS AND SERVICES FOR ELs AND THEIR FAMILIES (CONTINUED)",null,null,null,null,null,null,null,null,null,null,null,null,null,null,null,"E.  PROGRAMS AND SERVICES FOR ELs AND THEIR FAMILIES (CONTINUED)",null,null,null,null,null,null,null,null,null,null,null,null,null,null,null,"E.  PROGRAMS AND SERVICES FOR ELs AND THEIR FAMILIES (CONTINUED)",null,null,null,null,null,null,null,null,null,null,null,null,null,null,null,"E.  PROGRAMS AND SERVICES FOR ELs AND THEIR FAMILIES (CONTINUED)",null,null,null,null,null,null,null,null,null,null,null,null,null,null,null,"E.  PROGRAMS AND SERVICES FOR ELs AND THEIR FAMILIES (CONTINUED)",null,null,null,null,null,null,null,null,null,null,null,null,null,null,null,"E.  PROGRAMS AND SERVICES FOR ELs AND THEIR FAMILIES (CONTINUED)",null,null,null,null,null,null,null,null,null,null,null,null,null,null,null,"E.  PROGRAMS AND SERVICES FOR ELs AND THEIR FAMILIES (CONTINUED)",null,null,null,null,null,null,null,null,null,null,null,null,null,null,null,"E.  PROGRAMS AND SERVICES FOR ELs AND THEIR FAMILIES (CONTINUED)",null,null,null,null,null,null,null,null,null,null,null,null,null,null,null,"E.  PROGRAMS AND SERVICES FOR ELs AND THEIR FAMILIES (CONTINUED)",null,null,null,null,null,null,null,null,null,null,null,null,null,null,null,"E.  PROGRAMS AND SERVICES FOR ELs AND THEIR FAMILIES (CONTINUED)",null,null,null,null,null,null,null,null,null,null,null,null,null,null,null,"E.  PROGRAMS AND SERVICES FOR ELs AND THEIR FAMILIES (CONTINUED)",null,null,null,null,null,null,null,null,null,null,null,null,null,null,null,"E.  PROGRAMS AND SERVICES FOR ELs AND THEIR FAMILIES (CONTINUED)",null,null,null,null,null,null,null,null,null,null,null,null,null,null,null,"E.  PROGRAMS AND SERVICES FOR ELs AND THEIR FAMILIES (CONTINUED)",null,null,null,null,null,null,null,null,null,null,null,null,null,null,null,"E.  PROGRAMS AND SERVICES FOR ELs AND THEIR FAMILIES (CONTINUED)",null,null,null,null,null,null,null,null,null,null,null,null,null,null,null,"E.  PROGRAMS AND SERVICES FOR ELs AND THEIR FAMILIES (CONTINUED)",null,null,null,null,null,null,null,null,null,null,null,null,null,null,null,"E.  PROGRAMS AND SERVICES FOR ELs AND THEIR FAMILIES (CONTINUED)",null,null,null,null,null,null,null,null,null,null,null,null,null,null,null,"E.  PROGRAMS AND SERVICES FOR ELs AND THEIR FAMILIES (CONTINUED)",null,null,null,null,null,null,null,null,null,null,null,null,null,null,null,"E.  PROGRAMS AND SERVICES FOR ELs AND THEIR FAMILIES (CONTINUED)",null,null,null,null,null,null,null,null,null,null,null,null,null,null,null,"E.  PROGRAMS AND SERVICES FOR ELs AND THEIR FAMILIES (CONTINUED)",null,null,null,null,null,null,null,null,null,null,null,null,null,null,null,"E.  PROGRAMS AND SERVICES FOR ELs AND THEIR FAMILIES (CONTINUED)",null,null,null,null,null,null,null,null,null,null,null,null,null,null,null,"E.  PROGRAMS AND SERVICES FOR ELs AND THEIR FAMILIES (CONTINUED)",null,null,null,null,null,null,null,null,null,null,null,null,null,null,null,"E.  PROGRAMS AND SERVICES FOR ELs AND THEIR FAMILIES (CONTINUED)",null,null,null,null,null,null,null,null,null,null,null,null,null,null,null,"E.  PROGRAMS AND SERVICES FOR ELs AND THEIR FAMILIES (CONTINUED)",null,null,null,null,null,null,null,null,null,null,null,null,null,null,null,"E.  PROGRAMS AND SERVICES FOR ELs AND THEIR FAMILIES (CONTINUED)",null,null,null,null,null,null,null,null,null,null,null,null,null,null,null,"E.  PROGRAMS AND SERVICES FOR ELs AND THEIR FAMILIES (CONTINUED)",null,null,null,null,null,null,null,null,null,null,null,null,null,null,null,"E.  PROGRAMS AND SERVICES FOR ELs AND THEIR FAMILIES (CONTINUED)",null,null,null,null,null,null,null,null,null,null,null,null,null,null,null,"E.  PROGRAMS AND SERVICES FOR ELs AND THEIR FAMILIES (CONTINUED)",null,null,null,null,null,null,null,null,null,null,null,null,null,null,null,"E.  PROGRAMS AND SERVICES FOR ELs AND THEIR FAMILIES (CONTINUED)",null,null,null,null,null,null,null,null,null,null,null,null,null,null,null,"E.  PROGRAMS AND SERVICES FOR ELs AND THEIR FAMILIES (CONTINUED)",null,null,null,null,null,null,null,null,null,null,null,null,null,null,null,"E.  PROGRAMS AND SERVICES FOR ELs AND THEIR FAMILIES (CONTINUED)",null,null,null,null,null,null,null,null,null,null,null,null,null,null,null,"E.  PROGRAMS AND SERVICES FOR ELs AND THEIR FAMILIES (CONTINUED)",null,null,null,null,null,null,null,null,null,null,null,null,null,null,null,"E.  PROGRAMS AND SERVICES FOR ELs AND THEIR FAMILIES (CONTINUED)",null,null,null,null,null,null,null,null,null,null,null,null,null,null,null,"E.  PROGRAMS AND SERVICES FOR ELs AND THEIR FAMILIES (CONTINUED)",null,null,null,null,null,null,null,null,null,null,null,null,null,null,null,"E.  PROGRAMS AND SERVICES FOR ELs AND THEIR FAMILIES (CONTINUED)",null,null,null,null,null,null,null,null,null,null,null,null,null,null,null,"E.  PROGRAMS AND SERVICES FOR ELs AND THEIR FAMILIES (CONTINUED)",null,null,null,null,null,null,null,null,null,null,null,null,null,null,null,"E.  PROGRAMS AND SERVICES FOR ELs AND THEIR FAMILIES (CONTINUED)",null,null,null,null,null,null,null,null,null,null,null,null,null,null,null,"E.  PROGRAMS AND SERVICES FOR ELs AND THEIR FAMILIES (CONTINUED)",null,null,null,null,null,null,null,null,null,null,null,null,null,null,null,"E.  PROGRAMS AND SERVICES FOR ELs AND THEIR FAMILIES (CONTINUED)",null,null,null,null,null,null,null,null,null,null,null,null,null,null,null,"E.  PROGRAMS AND SERVICES FOR ELs AND THEIR FAMILIES (CONTINUED)",null,null,null,null,null,null,null,null,null,null,null,null,null,null,null,"E.  PROGRAMS AND SERVICES FOR ELs AND THEIR FAMILIES (CONTINUED)",null,null,null,null,null,null,null,null,null,null,null,null,null,null,null,"E.  PROGRAMS AND SERVICES FOR ELs AND THEIR FAMILIES (CONTINUED)",null,null,null,null,null,null,null,null,null,null,null,null,null,null,null,"E.  PROGRAMS AND SERVICES FOR ELs AND THEIR FAMILIES (CONTINUED)",null,null,null,null,null,null,null,null,null,null,null,null,null,null,null,"E.  PROGRAMS AND SERVICES FOR ELs AND THEIR FAMILIES (CONTINUED)",null,null,null,null,null,null,null,null,null,null,null,null,null,null,null,"E.  PROGRAMS AND SERVICES FOR ELs AND THEIR FAMILIES (CONTINUED)",null,null,null,null,null,null,null,null,null,null,null,null,null,null,null,"E.  PROGRAMS AND SERVICES FOR ELs AND THEIR FAMILIES (CONTINUED)",null,null,null,null,null,null,null,null,null,null,null,null,null,null,null,"E.  PROGRAMS AND SERVICES FOR ELs AND THEIR FAMILIES (CONTINUED)",null,null,null,null,null,null,null,null,null,null,null,null,null,null,null,"E.  PROGRAMS AND SERVICES FOR ELs AND THEIR FAMILIES (CONTINUED)",null,null,null,null,null,null,null,null,null,null,null,null,null,null,null,"E.  PROGRAMS AND SERVICES FOR ELs AND THEIR FAMILIES (CONTINUED)",null,null,null,null,null,null,null,null,null,null,null,null,null,null,null,"E.  PROGRAMS AND SERVICES FOR ELs AND THEIR FAMILIES (CONTINUED)",null,null,null,null,null,null,null,null,null,null,null,null,null,null,null,"E.  PROGRAMS AND SERVICES FOR ELs AND THEIR FAMILIES (CONTINUED)",null,null,null,null,null,null,null,null,null,null,null,null,null,null,null,"E.  PROGRAMS AND SERVICES FOR ELs AND THEIR FAMILIES (CONTINUED)",null,null,null,null,null,null,null,null,null,null,null,null,null,null,null,"E.  PROGRAMS AND SERVICES FOR ELs AND THEIR FAMILIES (CONTINUED)",null,null,null,null,null,null,null,null,null,null,null,null,null,null,null,"E.  PROGRAMS AND SERVICES FOR ELs AND THEIR FAMILIES (CONTINUED)",null,null,null,null,null,null,null,null,null,null,null,null,null,null,null,"E.  PROGRAMS AND SERVICES FOR ELs AND THEIR FAMILIES (CONTINUED)",null,null,null,null,null,null,null,null,null,null,null,null,null,null,null,"E.  PROGRAMS AND SERVICES FOR ELs AND THEIR FAMILIES (CONTINUED)",null,null,null,null,null,null,null,null,null,null,null,null,null,null,null,"E.  PROGRAMS AND SERVICES FOR ELs AND THEIR FAMILIES (CONTINUED)",null,null,null,null,null,null,null,null,null,null,null,null,null,null,null,"E.  PROGRAMS AND SERVICES FOR ELs AND THEIR FAMILIES (CONTINUED)",null,null,null,null,null,null,null,null,null,null,null,null,null,null,null,"E.  PROGRAMS AND SERVICES FOR ELs AND THEIR FAMILIES (CONTINUED)",null,null,null,null,null,null,null,null,null,null,null,null,null,null,null,"E.  PROGRAMS AND SERVICES FOR ELs AND THEIR FAMILIES (CONTINUED)",null,null,null,null,null,null,null,null,null,null,null,null,null,null,null,"E.  PROGRAMS AND SERVICES FOR ELs AND THEIR FAMILIES (CONTINUED)",null,null,null,null,null,null,null,null,null,null,null,null,null,null,null,"E.  PROGRAMS AND SERVICES FOR ELs AND THEIR FAMILIES (CONTINUED)",null,null,null,null,null,null,null,null,null,null,null,null,null,null,null,"E.  PROGRAMS AND SERVICES FOR ELs AND THEIR FAMILIES (CONTINUED)",null,null,null,null,null,null,null,null,null,null,null,null,null,null,null,"E.  PROGRAMS AND SERVICES FOR ELs AND THEIR FAMILIES (CONTINUED)",null,null,null,null,null,null,null,null,null,null,null,null,null,null,null,"E.  PROGRAMS AND SERVICES FOR ELs AND THEIR FAMILIES (CONTINUED)",null,null,null,null,null,null,null,null,null,null,null,null,null,null,null,"E.  PROGRAMS AND SERVICES FOR ELs AND THEIR FAMILIES (CONTINUED)",null,null,null,null,null,null,null,null,null,null,null,null,null,null,null,"E.  PROGRAMS AND SERVICES FOR ELs AND THEIR FAMILIES (CONTINUED)",null,null,null,null,null,null,null,null,null,null,null,null,null,null,null,"E.  PROGRAMS AND SERVICES FOR ELs AND THEIR FAMILIES (CONTINUED)",null,null,null,null,null,null,null,null,null,null,null,null,null,null,null,"E.  PROGRAMS AND SERVICES FOR ELs AND THEIR FAMILIES (CONTINUED)",null,null,null,null,null,null,null,null,null,null,null,null,null,null,null,"E.  PROGRAMS AND SERVICES FOR ELs AND THEIR FAMILIES (CONTINUED)",null,null,null,null,null,null,null,null,null,null,null,null,null,null,null,"E.  PROGRAMS AND SERVICES FOR ELs AND THEIR FAMILIES (CONTINUED)",null,null,null,null,null,null,null,null,null,null,null,null,null,null,null,"E.  PROGRAMS AND SERVICES FOR ELs AND THEIR FAMILIES (CONTINUED)",null,null,null,null,null,null,null,null,null,null,null,null,null,null,null,"E.  PROGRAMS AND SERVICES FOR ELs AND THEIR FAMILIES (CONTINUED)",null,null,null,null,null,null,null,null,null,null,null,null,null,null,null,"E.  PROGRAMS AND SERVICES FOR ELs AND THEIR FAMILIES (CONTINUED)",null,null,null,null,null,null,null,null,null,null,null,null,null,null,null,"E.  PROGRAMS AND SERVICES FOR ELs AND THEIR FAMILIES (CONTINUED)",null,null,null,null,null,null,null,null,null,null,null,null,null,null,null,"E.  PROGRAMS AND SERVICES FOR ELs AND THEIR FAMILIES (CONTINUED)",null,null,null,null,null,null,null,null,null,null,null,null,null,null,null,"E.  PROGRAMS AND SERVICES FOR ELs AND THEIR FAMILIES (CONTINUED)",null,null,null,null,null,null,null,null,null,null,null,null,null,null,null,"E.  PROGRAMS AND SERVICES FOR ELs AND THEIR FAMILIES (CONTINUED)",null,null,null,null,null,null,null,null,null,null,null,null,null,null,null,"E.  PROGRAMS AND SERVICES FOR ELs AND THEIR FAMILIES (CONTINUED)",null,null,null,null,null,null,null,null,null,null,null,null,null,null,null,"E.  PROGRAMS AND SERVICES FOR ELs AND THEIR FAMILIES (CONTINUED)",null,null,null,null,null,null,null,null,null,null,null,null,null,null,null,"E.  PROGRAMS AND SERVICES FOR ELs AND THEIR FAMILIES (CONTINUED)",null,null,null,null,null,null,null,null,null,null,null,null,null,null,null,"E.  PROGRAMS AND SERVICES FOR ELs AND THEIR FAMILIES (CONTINUED)",null,null,null,null,null,null,null,null,null,null,null,null,null,null,null,"E.  PROGRAMS AND SERVICES FOR ELs AND THEIR FAMILIES (CONTINUED)",null,null,null,null,null,null,null,null,null,null,null,null,null,null,null,"E.  PROGRAMS AND SERVICES FOR ELs AND THEIR FAMILIES (CONTINUED)",null,null,null,null,null,null,null,null,null,null,null,null,null,null,null,"E.  PROGRAMS AND SERVICES FOR ELs AND THEIR FAMILIES (CONTINUED)",null,null,null,null,null,null,null,null,null,null,null,null,null,null,null,"E.  PROGRAMS AND SERVICES FOR ELs AND THEIR FAMILIES (CONTINUED)",null,null,null,null,null,null,null,null,null,null,null,null,null,null,null,"E.  PROGRAMS AND SERVICES FOR ELs AND THEIR FAMILIES (CONTINUED)",null,null,null,null,null,null,null,null,null,null,null,null,null,null,null,"E.  PROGRAMS AND SERVICES FOR ELs AND THEIR FAMILIES (CONTINUED)",null,null,null,null,null,null,null,null,null,null,null,null,null,null,null,"E.  PROGRAMS AND SERVICES FOR ELs AND THEIR FAMILIES (CONTINUED)",null,null,null,null,null,null,null,null,null,null,null,null,null,null,null,"E.  PROGRAMS AND SERVICES FOR ELs AND THEIR FAMILIES (CONTINUED)",null,null,null,null,null,null,null,null,null,null,null,null,null,null,null,"E.  PROGRAMS AND SERVICES FOR ELs AND THEIR FAMILIES (CONTINUED)",null,null,null,null,null,null,null,null,null,null,null,null,null,null,null,"E.  PROGRAMS AND SERVICES FOR ELs AND THEIR FAMILIES (CONTINUED)",null,null,null,null,null,null,null,null,null,null,null,null,null,null,null,"E.  PROGRAMS AND SERVICES FOR ELs AND THEIR FAMILIES (CONTINUED)",null,null,null,null,null,null,null,null,null,null,null,null,null,null,null,"E.  PROGRAMS AND SERVICES FOR ELs AND THEIR FAMILIES (CONTINUED)",null,null,null,null,null,null,null,null,null,null,null,null,null,null,null,"E.  PROGRAMS AND SERVICES FOR ELs AND THEIR FAMILIES (CONTINUED)",null,null,null,null,null,null,null,null,null,null,null,null,null,null,null,"E.  PROGRAMS AND SERVICES FOR ELs AND THEIR FAMILIES (CONTINUED)",null,null,null,null,null,null,null,null,null,null,null,null,null,null,null,"E.  PROGRAMS AND SERVICES FOR ELs AND THEIR FAMILIES (CONTINUED)",null,null,null,null,null,null,null,null,null,null,null,null,null,null,null,"E.  PROGRAMS AND SERVICES FOR ELs AND THEIR FAMILIES (CONTINUED)",null,null,null,null,null,null,null,null,null,null,null,null,null,null,null,"E.  PROGRAMS AND SERVICES FOR ELs AND THEIR FAMILIES (CONTINUED)",null,null,null,null,null,null,null,null,null,null,null,null,null,null,null,"E.  PROGRAMS AND SERVICES FOR ELs AND THEIR FAMILIES (CONTINUED)",null,null,null,null,null,null,null,null,null,null,null,null,null,null,null,"E.  PROGRAMS AND SERVICES FOR ELs AND THEIR FAMILIES (CONTINUED)",null,null,null,null,null,null,null,null,null,null,null,null,null,null,null,"E.  PROGRAMS AND SERVICES FOR ELs AND THEIR FAMILIES (CONTINUED)",null,null,null,null,null,null,null,null,null,null,null,null,null,null,null,"E.  PROGRAMS AND SERVICES FOR ELs AND THEIR FAMILIES (CONTINUED)",null,null,null,null,null,null,null,null,null,null,null,null,null,null,null,"E.  PROGRAMS AND SERVICES FOR ELs AND THEIR FAMILIES (CONTINUED)",null,null,null,null,null,null,null,null,null,null,null,null,null,null,null,"E.  PROGRAMS AND SERVICES FOR ELs AND THEIR FAMILIES (CONTINUED)",null,null,null,null,null,null,null,null,null,null,null,null,null,null,null,"E.  PROGRAMS AND SERVICES FOR ELs AND THEIR FAMILIES (CONTINUED)",null,null,null,null,null,null,null,null,null,null,null,null,null,null,null,"E.  PROGRAMS AND SERVICES FOR ELs AND THEIR FAMILIES (CONTINUED)",null,null,null,null,null,null,null,null,null,null,null,null,null,null,null,"E.  PROGRAMS AND SERVICES FOR ELs AND THEIR FAMILIES (CONTINUED)",null,null,null,null,null,null,null,null,null,null,null,null,null,null,null,"E.  PROGRAMS AND SERVICES FOR ELs AND THEIR FAMILIES (CONTINUED)",null,null,null,null,null,null,null,null,null,null,null,null,null,null,null,"E.  PROGRAMS AND SERVICES FOR ELs AND THEIR FAMILIES (CONTINUED)",null,null,null,null,null,null,null,null,null,null,null,null,null,null,null,"E.  PROGRAMS AND SERVICES FOR ELs AND THEIR FAMILIES (CONTINUED)",null,null,null,null,null,null,null,null,null,null,null,null,null,null,null,"E.  PROGRAMS AND SERVICES FOR ELs AND THEIR FAMILIES (CONTINUED)",null,null,null,null,null,null,null,null,null,null,null,null,null,null,null,"E.  PROGRAMS AND SERVICES FOR ELs AND THEIR FAMILIES (CONTINUED)",null,null,null,null,null,null,null,null,null,null,null,null,null,null,null,"E.  PROGRAMS AND SERVICES FOR ELs AND THEIR FAMILIES (CONTINUED)",null,null,null,null,null,null,null,null,null,null,null,null,null,null,null,"E.  PROGRAMS AND SERVICES FOR ELs AND THEIR FAMILIES (CONTINUED)",null,null,null,null,null,null,null,null,null,null,null,null,null,null,null,"E.  PROGRAMS AND SERVICES FOR ELs AND THEIR FAMILIES (CONTINUED)",null,null,null,null,null,null,null,null,null,null,null,null,null,null,null,"E.  PROGRAMS AND SERVICES FOR ELs AND THEIR FAMILIES (CONTINUED)",null,null,null,null,null,null,null,null,null,null,null,null,null,null,null,"E.  PROGRAMS AND SERVICES FOR ELs AND THEIR FAMILIES (CONTINUED)",null,null,null,null,null,null,null,null,null,null,null,null,null,null,null,"E.  PROGRAMS AND SERVICES FOR ELs AND THEIR FAMILIES (CONTINUED)",null,null,null,null,null,null,null,null,null,null,null,null,null,null,null,"E.  PROGRAMS AND SERVICES FOR ELs AND THEIR FAMILIES (CONTINUED)",null,null,null,null,null,null,null,null,null,null,null,null,null,null,null,"E.  PROGRAMS AND SERVICES FOR ELs AND THEIR FAMILIES (CONTINUED)",null,null,null,null,null,null,null,null,null,null,null,null,null,null,null,"E.  PROGRAMS AND SERVICES FOR ELs AND THEIR FAMILIES (CONTINUED)",null,null,null,null,null,null,null,null,null,null,null,null,null,null,null,"E.  PROGRAMS AND SERVICES FOR ELs AND THEIR FAMILIES (CONTINUED)"]
["Box 8:  Coordination of Service.  Describe the partnership between this program community, organizations, and other local, state and/or federal programs within the division.  Possible services could include: community partnerships, specialized programs, such as the gifted program, college and career readiness, special education, preschool, Title I, Title II, and Title IV. "]
[" The ACPS Federal Program Coordinators (Title I, Title II, Title III, Migrant, and Homeless) meet monthly to share and collaboratively problem-solve in order to remain aligned and efficient in our practices.  \nThe Title III Coordinator and ESOL staff partner with the following ACPS departments to ensure equitable practices for ELs across the division: (1) Special Education; (2) Lead and Instructional Coaches; (3) the Equity and Diversity Committee; (4) the Department of Technology; (4) Social Emotional Academic Development (SEAD); (5) Family Engagement and Encouragement Development (FEED); (6) Community Engagement teams; (7) Gifted and Talented Education (GTE); (8) Career and Technology Education (CTE); (9) School Counselors; and (10) Attendance and Discipline. ELs who need additional support are monitored by a team of stakeholders through the Multi-Tiered System of Supports (MTSS) and School-Based Intervention Teams (SBIT). Team members include administrators, content area teachers, ESOL teachers, Specialists, and family members, who meet quarterly to crowd-source appropriate interventions and document students’ academic progress. ESOL staff members provide supplemental support to Dual Language Learners (DLLs) in ACPS Preschool Programs. They regularly attend the Preschool Professional Learning Community (PLC) in order to build relationships with teachers, stay current on their instructional needs, and provide differentiation strategies and instructional resources. \nThe Title III Coordinator and ESOL staff collaborate with the following community organizations to empower EL families in the school division: (1) the University of Virginia (UVA) Curry School of Education and Latinx Student Alliance; (2) the International Rescue Committee (IRC) and International Neighbors; (3) the Department of Social Services; (4) Region 10; (5) Ready Kids; (6) Counseling Alliance of Virginia (CAVA); (7) The Women’s Initiative; (8) Creciendo Juntos and Sin Barreras Latinx advisory groups; (9) Boys & Girls Club; and (10) the Soccer Organization of Charlottesville Area (SOCA).\n\n\n"]
[]
["Application ESSA Compliance Components using Title III Funds"]
["Sec. 3115(g) Supplement Not Supplant:  Federal funds made available under this subgrant shall be used so as to supplement the level of Federal, State and local funds that, in the absence of such availability, would have been expended for programs for English learners and immigrant children and youth and in no case to supplant such Federal, state and local public funds. \n\nSec. 3115(c)(1-3) Required Subgrantee Activities using  Title III Funds"]
[]
["Box 9:  Describe how the LEA will use  Title III funds to provide supplemental support to help ELs increase EL proficiency and meet the challenging State academic standards. This may include providing resources, materials, personnel, curriculum enhancement, coordination with other programs and creative initiatives to support an effective LIEP."]
[" The ACPS ESOL program welcomes the county’s culturally and linguistically diverse students and ensures their academic, civic, and economic success with a rigorous curriculum and engaging pedagogy. ACPS’ Lau Plan adheres to Title I and III provisions. Title III funds are used to fund personnel, activities, materials, and resources that supplement ACPS’ core instructional programs. \n\nA committee of ESOL teachers has developed a rubric by which we evaluate supplemental language resources, such as Imagine Learning. This supplemental English language product has interactive, targeted exercises with a student account system that allows teachers to track ELs’ linguistic progress and use the data in the Response to Instruction (RTI) process.\n\nACPS uses Title III funds to offer supplementary after-school and summer programming in order to provide ELs with additional time to acquire English. Tutors are hired after school and in the summer to meet identified academic areas of need. To prevent academic summer regression, we target SLIFE students, Recently Arrived ELs, Long-Term ELs, and ELs transitioning between elementary, middle, and high school through our supplemental Summer Immersion Excursion Program. Should we be unable to meet in person, due to COVID-19, ACPS will redesign Summer Immersion Excursion into a remote learning experience, scaffolded for the diverse populations of ELs listed above."]
["Page 24"]
[null,null,null,null,"School Division:",null,{"$f":"'Title III Budget'!$A$16","v":"ALBEMARLE COUNTY PUBLIC SCHOOLS"},null,null,null,null,null,"Division Number:",null,null,{"$f":"'Title III Budget'!$H$16","v":2}]
["E.  PROGRAMS AND SERVICES FOR ELs AND THEIR FAMILIES (CONTINUED)"]
[]
["Box 10.  Describe how the LEA will use  Title III funds to provide supplemental support for effective professional development (PD) to support: 1) classroom teachers, 2) principals, 3) support staff, 4) administrators, and 5) others.  "]
["All ACPS ESOL teachers participate in quarterly team PDs that help them provide targeted language lessons to ELs a focus on specific skill sets identified through ACPS’ ESOL Curriculum. The ESOL program works with the PD department to provide supplemental training to help content area teachers, Specialists, administrators, and support staff recognize the rich cultural, economic, and intellectual resources of our multilingual students, and leverage their strengths. Areas of need are based on the results of the ongoing ESOL Program Evaluation Process. \n\nThe ESOL program uses Title III funds to build and expand on our in-house cadre of expert trainers by sending committed ESOL and content area partners to PDs, such as the Center for Applied Linguistics’ “SIOP” and “What’s Different About Teaching Reading to Students Learning English?” trainings. ESOL and content teacher teams use their acquired knowledge to collaboratively create professional learning experiences for their colleagues. Additional PD workshops are offered as ACPS Opportunities Courses to all teachers across the division. An intentional effort is made to include PD workshops that support best instructional practices for teachers of ELs. With this mindset, we strive to help all educators see themselves as teachers of ELs and build their understanding, skills, and capacities to meet ELs’ needs.\n\nThis year we plan to send a team of ESOL teachers to the SATESOL and VESA conferences to design ACPS-specific PD on SLIFE, Recently Arrived, Long-Term, and Dually Identified ELs. Additional key areas of focus will include family engagement during and post COVID-19, activating prior knowledge and academic vocabulary, phonemic awareness, concepts of print, sight words, and remote learning strategies and resources for ELs. "]
[]
["Box 11.  Describe how the LEA will use  Title III funds to provide supplemental support to parent, family and community engagement activities. You may identify strategies used in coordination with other related programs, such as Title I, Part A, college and career readiness, and preschool programs."]
["Title III funds for the ESOL Family Engagement Liaison and supplemental family engagement events will support several programs to develop stronger partnerships among ACPS families, schools, and community. The Family Engagement Liaison will collaborate with division and community stakeholders involved in family engagement, including the FEED Team, SEAD Team, Title I Specialists, Bright Stars Preschool, Community Engagement Department, and school-based Region 10 support staff. This collaboration will ensure that EL families’ needs are considered in all division family engagement initiatives.  ACPS recognizes that a key to ensuring improved partnerships with EL families is breaking down the language barrier to provide equity of access to opportunities. To this end, we have developed a division-wide system of interpretation and translation services. During the 2020-2021 academic year, the Family Engagement Liaison will host multiple trainings for new and returning interpreters to ensure high expectations and aligned practices. During the 2020-2021 academic year, the Family Engagement Liaison will pilot a multilingual “welcome toolkit” initiative of school and community resources for new families registering at the International & ESOL Welcome Center. The toolkits are designed to build families’ capacities, deepen their knowledge of the community, build relationships with school staff, and become empowered members of ACPS. Additionally, the Family Engagement Liaison will build capacity through Family Literacy Programs in schools, where EL parents will develop English language skills and learn about community resources while their children receive academic support. Family Literacy Programs in ACPS will involve (1) a school location for the sessions; (2) EL families; (3) community volunteers; (4) and a Site Director from ACPS to oversee the program. The Site Director responsibilities will include: (1) promote the program at their school and encourage families to participate; (2) communicate regularly with teachers for information regarding students’ academic needs and learning targets; (3) provide educational  materials and resources to students, families, and volunteers; (4) coordinate student and volunteer partnerships; (5) coordinate ACPS and volunteer schedules; (6) provide on-site support to address needs, challenges as they arise.\n"]
["Page 25"]
[null,null,null,null,"School Division:",null,{"$f":"'Title III Budget'!$A$16","v":"ALBEMARLE COUNTY PUBLIC SCHOOLS"},null,null,null,null,null,"Division Number:",null,null,{"$f":"'Title III Budget'!$H$16","v":2}]
[]
["G.  MEASURABLE OBJECTIVES "]
["Section 1"]
["Section 4104(a)(2) of ESSA requires that States report the degree to which divisions have made progress toward meeting the objectives and outcomes in their approved applications."]
["Describe the division's progress towards meeting the measurable objectives. Address each measurable objective for which activities were implemented in the previous year. Indicate the application year for the measurable objective and include relevant data. "]
[]
["Measurable Objective 1:"]
["NA"]
[]
["Measurable Objective 2:"]
["NA"]
[]
["Measurable Objective 3:"]
["NA"]
[]
["Measurable Objective 4:"]
["NA"]
[]
["Page 26"]
[null,null,null,null,"School Division:",null,{"$f":"'Title III Budget'!$A$16","v":"ALBEMARLE COUNTY PUBLIC SCHOOLS"},null,null,null,null,null,"Division Number:",null,null,{"$f":"'Title III Budget'!$H$16","v":2}]
["G.   MEASURABLE OBJECTIVES (CONTINUED)"]
["Measurable Objective 5:"]
["NA"]
[]
["Section 2"]
["1.","State up to five measurable objectives, each incorporating the four components, that will guide the development of the program to be funded with the requested ESEA federal funds. "]
["2.","Describe the evidence-based research that supports the services and activities (programs, models, instructional methods, and techniques) that will be implemented to achieve each objective and that will be supported by the requested funds. \nWhat is a Measurable Objective?\nA measurable objective has four components:\n1) Subject (Who is the target or focus?);\n2) Behavior (What will be changed/improved?);\n3) Specific criteria for assessing improvement, readiness, or achievement and tools to be used to measure effectiveness; and\n4) Time period for performance or assessment.\n"]
["Measurable Objective 1:"]
["By the end of 2020-2021, 75% of ELs will demonstrate progress in acquiring ELP, in alignment with the VDOE’s guidance on English Learner Progress in Learning English Using ACCESS 2.0 Scores Composite Proficiency Level Gains."]
[]
["Effective research-based services and activities that will be implemented and supported by the requested funds to achieve the objective."]
["Teachers will serve as ESOL Advisors to progress monitor their ELs’ linguistic growth as compared to the ACPS ESOL Benchmarks. They will strive to help their ELs meet these benchmarks by working with them to set quarterly language goals in the four domains of listening, speaking, reading, and writing. The goals are individualized based on ELs’ English languages proficiency levels, and drawn from the WIDA Can Do Descriptors and our teacher-created ESOL Language Goals. Students who encounter challenges in meeting benchmarks will be identified early so that additional support, including supplemental learning opportunities after school and during the summer, can be provided in a timely manner."]
["Page 27"]
[null,null,null,null,"School Division:",null,{"$f":"'Title III Budget'!$A$16","v":"ALBEMARLE COUNTY PUBLIC SCHOOLS"},null,null,null,null,null,"Division Number:",null,null,{"$f":"'Title III Budget'!$H$16","v":2}]
["G.  MEASURABLE OBJECTIVES (CONTINUED)"]
["Measurable Objective 2:"]
["By the end of 2020-2021, 25% of our Level 4 ELs will attain proficiency and therefore exit the ESOL program by earning a composite score of 4.4 or above on the WIDA ACCESS for ELLs 2.0 assessment. "]
[]
["Effective research-based services and activities that will be implemented and supported by the requested funds to achieve the objective."]
["Data analysis by the International and ESOL Welcome Center will identify students across the division who appear to be plateauing after attaining an ELP level of 3.0 and higher. We will use this analysis to target instruction and shift resources to support students who are struggling to reach full proficiency in English. We will focus on supporting content area teachers to build language objectives into their lessons to advance the ELP of higher-level ELs. We will continue to leverage the RTI process and collaborative ESOL and classroom teacher partnerships to support higher-level ELs who have been in the program longer than expected and are not making sufficient progress toward full proficiency. Additionally, we will focus on Long-Term ELs and their engagement of the goal-setting process to help avoid languishing in the ESOL program."]
[]
["Measurable Objective 3:"]
["In the spring of 2021, 65% of ELs taking the reading SOL will score at the proficient level, thus reducing the opportunity gap between ELs and all students in the division by at least 5 percent."]
[]
["Effective research-based services and activities that will be implemented and supported by the requested funds to achieve the objective."]
["Effective, research-based services and activities that will be implemented and supported by the requested funds to achieve the objective include providing professional development to classroom teachers in how to incorporate academic vocabulary and differentiation strategies to improve comprehension throughout the curriculum. \n\nFor our younger ELs, ACPS will focus ESOL language support and PD on developing strong academic vocabulary and background knowledge, phonemic awareness, phonics, concepts of print, and sight words, as these capacities are most important for emergent language acquisition (Dickinson & Snow, 1987; Dickinson & Tabors, 2001; Snow & Tabors, 1993; Whitehurst & Lonigan, 1998). \n\nFor our adolescent ELs, we will target those struggling with reading comprehension across the content areas and provide supplemental support through the RTI process. "]
[]
["Page 28"]
[null,null,null,null,"School Division:",null,{"$f":"'Title III Budget'!$A$16","v":"ALBEMARLE COUNTY PUBLIC SCHOOLS"},null,null,null,null,null,"Division Number:",null,null,{"$f":"'Title III Budget'!$H$16","v":2}]
["G.   MEASURABLE OBJECTIVES (CONTINUED)"]
["Measurable Objective 4:"]
["In the spring of 2021, 70% of ELs taking the Mathematics SOL will score at the proficient level, thus reducing the opportunity gap between ELs and all students in the division by at least 5 percent."]
["Effective research-based services and activities that will be implemented and supported by the requested funds to achieve the objective."]
["ACPS will continue using SIOP strategies to support teachers in the incorporation of language development into Math lessons. We will continue to expand our use of language-rich Math strategies, such as number talks, to support ELs’ comprehension of the language of Mathematics. Additionally, ST Math Intervention will be used for our SLIFE students. "]
[]
["Measurable Objective 5:"]
["In the spring of 2021, the percentage of ELs graduating on time will continue to exceed the Federal Graduation Indicator (FGI). \n\nEffective research-based services and activities that will be implemented and supported by the requested funds to achieve the objective. \n\nOur secondary program will continue to create clear graduation plans with students. ESOL teachers will work closely with students and their families through the school counseling departments to create a graduation and post-secondary plan. ESOL teachers will collaborate with content teachers as well as community organizations to connect students' academic work to their goals outside of school. Students who are struggling to meet graduation requirements will be identified early so that additional support, including supplemental learning opportunities and tutoring after school and during the summer, can be provided in a timely manner. We will seek to enroll more ELs in Honors, Advanced Placement, and Dual Enrollment courses to ensure equitable opportunities for a rigorous, language-rich curriculum."]
[]
["Page 29"]
[null,null,null,null,"School Division:",null,{"$f":"'Title III Budget'!$A$16","v":"ALBEMARLE COUNTY PUBLIC SCHOOLS"},null,null,null,null,null,"Division Number:",null,null,{"$f":"'Title III Budget'!$H$16","v":2}]
["H.  TITLE III PROGRAM DETAILS"]
[]
["Possible Subgrant Activities"]
[]
["Sec. 3116(d)(1-9) – Possible Subgrantee Activities: Place an X next to the activities below if you will use Title III funds in \n2020-2021 to provide these activities."]
["Box A."]
["Possible Activities Serving ELs in LEAs Receiving Title III Funds",null,null,null,null,null,null,null,null,null,null,null,"Place an X to show how funds will be used this year\n(2020-2021)\n"]
["Supporting the development and implementation of LIEPs",null,null,null,null,null,null,null,null,null,null,null,"X"]
["Enhancing existing LIEPs and programs for restructuring and reforming schools with EL populations",null,null,null,null,null,null,null,null,null,null,null,"X"]
["Supporting implementation of school wide programs"]
["Professional development to teachers and other personnel serving Els",null,null,null,null,null,null,null,null,null,null,null,"X"]
["Parent, family and community engagement activities",null,null,null,null,null,null,null,null,null,null,null,"X"]
["Supporting the development and implementation of pre-school programs"]
["Improving LIEPs by upgrading curricula, instructional materials, software and assessment procedures",null,null,null,null,null,null,null,null,null,null,null,"X"]
["Improving instruction of ELs with disabilities",null,null,null,null,null,null,null,null,null,null,null,"X"]
["Providing tutorials, career and technical education",null,null,null,null,null,null,null,null,null,null,null,"X"]
["Offering programs to help ELs achieve success in post-secondary education"]
["Other (if other is marked with an X - Please describe the activity conducted) ",null,null,null,null,null,null,null,null,null,null,null,"X Summer Immersion \nExcursion Program"]
[]
["Page 30"]

{"sheet":"IY","index":3,"n_rows":17,"n_cols":16,"rows_kept":17,"cut":false,"hidden":false,"merged":[[16,0,16,15],[1,0,1,15],[7,0,7,15],[3,0,3,15],[14,0,14,15],[9,0,9,15],[11,0,11,15],[12,0,12,15],[15,0,15,15]]}
[null,null,null,null,"School Division:",null,{"$f":"'Title III Budget'!$A$16","v":"ALBEMARLE COUNTY PUBLIC SCHOOLS"},null,null,null,null,null,"Division Number:",null,null,{"$f":"'Title III Budget'!$H$16","v":2}]
["J.  Immigrant Children and Youth (IY) Funds Under Title III"]
[]
["Complete if IY funds are allocated"]
[]
["Purpose of Immigrant Children and Youth (IY) Funds"]
[]
["Under Section 3114 of the ESEA, Immigrant Children and Youth (IY) funds may be used for supplemental services to improve the academic achievement of IY students including activities that increase the knowledge and skills of teachers who serve IY students. All services provided to IY students  using IY funds must supplement, and not supplant, the services that must be provided to IY students under Title VI of the Civil Rights Act of 1964 (Title VI), the Equal Educational Opportunities Act of 1974 (EEOA), and other requirements, including those under State or local laws. Immigrant Children and Youth (IY) funds must solely be expended on programs and services for immigrant students or their families. "]
[]
["Description of Program and Services for Immigrant Students "]
[]
["Describe how the division will use Immigrant Children and Youth (IY) funds to provide enhanced instructional opportunities specifically for immigrant students or their families:"]
[]
[]
["Describe how the division will evaluate the success of the enhanced instructional opportunities targeting immigrant students or their families:"]
[]
["Page 31"]

{"sheet":"Private Schools","index":4,"n_rows":95,"n_cols":20,"rows_kept":95,"cut":false,"hidden":false,"merged":[[31,0,31,19],[29,0,29,19],[94,0,94,19],[78,0,78,4],[78,5,78,6],[78,7,78,8],[78,9,78,13],[89,9,89,13],[90,9,90,13],[85,9,85,13],[86,9,86,13],[84,9,84,13],[88,9,88,13],[87,9,87,13],[82,5,82,6],[82,7,82,8],[84,7,84,8],[85,0,85,4],[85,5,85,6],[85,7,85,8],[88,0,88,4],[88,5,88,6],[88,7,88,8],[76,0,76,4],[76,5,76,6],[76,7,76,8],[76,9,76,13],[76,14,76,17],[77,0,77,4],[77,5,77,6],[77,7,77,8],[77,9,77,13],[77,14,77,17],[73,0,73,4],[73,5,73,6],[73,7,73,8],[73,9,73,13],[74,0,74,4],[74,5,74,6],[74,7,74,8],[74,9,74,13],[75,0,75,4],[75,5,75,6],[75,7,75,8],[75,9,75,13],[37,0,37,4],[37,5,37,6],[37,7,37,8],[37,9,37,13],[11,21,11,24],[18,1,18,10],[19,1,19,10],[35,0,35,4],[35,5,35,6],[35,7,35,8],[35,9,35,13],[20,1,20,10],[13,21,13,24],[24,1,24,10],[25,1,25,10],[25,11,25,19],[28,0,28,19],[35,18,35,19],[36,18,36,19],[36,0,36,4],[36,5,36,6],[36,7,36,8],[36,9,36,13],[35,14,35,17],[72,9,72,13],[69,0,69,4],[69,5,69,6],[69,7,69,8],[69,9,69,13],[70,0,70,4],[70,5,70,6],[70,7,70,8],[70,9,70,13],[71,0,71,4],[71,5,71,6],[71,7,71,8],[71,9,71,13],[72,0,72,4],[72,5,72,6],[72,7,72,8],[79,0,79,4],[79,5,79,6],[79,7,79,8],[80,7,80,8],[79,9,79,13],[81,0,81,4],[81,5,81,6],[81,7,81,8],[80,9,80,13],[81,9,81,13],[86,14,86,17],[91,14,91,17],[84,0,84,4],[84,5,84,6],[86,0,86,4],[86,5,86,6],[86,7,86,8],[89,0,89,4],[89,5,89,6],[89,7,89,8],[87,0,87,4],[87,5,87,6],[87,7,87,8],[38,0,38,4],[38,5,38,6],[38,7,38,8],[38,9,38,13],[39,0,39,4],[39,5,39,6],[39,7,39,8],[39,9,39,13],[93,7,93,8],[92,7,92,8],[91,0,91,6],[91,9,91,13],[91,7,91,8],[90,0,90,4],[90,5,90,6],[90,7,90,8],[83,9,83,13],[83,0,83,4],[83,5,83,6],[83,7,83,8],[82,9,82,13],[80,0,80,4],[80,5,80,6],[82,0,82,4],[40,0,40,4],[40,5,40,6],[40,7,40,8],[40,9,40,13],[41,0,41,4],[41,5,41,6],[41,7,41,8],[41,9,41,13],[41,14,41,17],[44,0,44,4],[44,5,44,6],[44,7,44,8],[44,9,44,13],[45,0,45,4],[45,5,45,6],[45,7,45,8],[45,9,45,13],[42,0,42,4],[42,5,42,6],[42,7,42,8],[42,9,42,13],[43,0,43,4],[43,5,43,6],[43,7,43,8],[43,9,43,13],[48,0,48,4],[48,5,48,6],[48,7,48,8],[48,9,48,13],[49,0,49,4],[49,5,49,6],[49,7,49,8],[49,9,49,13],[46,0,46,4],[46,5,46,6],[46,7,46,8],[46,9,46,13],[47,0,47,4],[47,5,47,6],[47,7,47,8],[47,9,47,13],[50,0,50,4],[50,5,50,6],[50,7,50,8],[50,9,50,13],[51,0,51,4],[51,5,51,6],[51,7,51,8],[51,9,51,13],[51,14,51,17],[54,0,54,4],[54,5,54,6],[54,7,54,8],[54,9,54,13],[55,0,55,4],[55,5,55,6],[55,7,55,8],[55,9,55,13],[52,0,52,4],[52,5,52,6],[52,7,52,8],[52,9,52,13],[53,0,53,4],[53,5,53,6],[53,7,53,8],[53,9,53,13],[58,0,58,4],[58,5,58,6],[58,7,58,8],[58,9,58,13],[59,0,59,4],[59,5,59,6],[59,7,59,8],[59,9,59,13],[56,0,56,4],[56,5,56,6],[56,7,56,8],[56,9,56,13],[57,0,57,4],[57,5,57,6],[57,7,57,8],[57,9,57,13],[62,0,62,4],[62,5,62,6],[62,7,62,8],[62,9,62,13],[63,0,63,4],[63,5,63,6],[63,7,63,8],[63,9,63,13],[60,0,60,4],[60,5,60,6],[60,7,60,8],[60,9,60,13],[61,0,61,4],[61,5,61,6],[61,7,61,8],[61,9,61,13],[64,0,64,4],[64,5,64,6],[64,7,64,8],[64,9,64,13],[65,0,65,4],[65,5,65,6],[65,7,65,8],[65,9,65,13],[66,14,66,17],[68,0,68,4],[68,5,68,6],[68,7,68,8],[68,9,68,13],[66,0,66,4],[66,5,66,6],[66,7,66,8],[66,9,66,13],[67,0,67,4],[67,5,67,6],[67,7,67,8],[67,9,67,13],[1,0,1,19],[3,0,3,19],[7,0,7,19],[13,13,13,19],[18,11,18,19],[19,11,19,19],[20,11,20,19],[21,11,21,19],[24,11,24,19],[21,1,21,10],[15,15,15,17],[36,14,36,17],[37,14,37,17],[37,18,37,19],[38,14,38,17],[38,18,38,19],[39,14,39,17],[39,18,39,19],[40,14,40,17],[40,18,40,19],[41,18,41,19],[42,14,42,17],[42,18,42,19],[43,14,43,17],[43,18,43,19],[44,14,44,17],[44,18,44,19],[45,14,45,17],[45,18,45,19],[46,18,46,19],[47,14,47,17],[47,18,47,19],[48,14,48,17],[48,18,48,19],[49,14,49,17],[49,18,49,19],[50,14,50,17],[50,18,50,19],[46,14,46,17],[51,18,51,19],[52,14,52,17],[52,18,52,19],[53,14,53,17],[53,18,53,19],[54,14,54,17],[54,18,54,19],[55,14,55,17],[55,18,55,19],[56,18,56,19],[57,14,57,17],[57,18,57,19],[58,14,58,17],[58,18,58,19],[59,14,59,17],[59,18,59,19],[60,14,60,17],[60,18,60,19],[56,14,56,17],[61,18,61,19],[62,14,62,17],[62,18,62,19],[63,14,63,17],[63,18,63,19],[64,14,64,17],[64,18,64,19],[65,14,65,17],[65,18,65,19],[61,14,61,17],[66,18,66,19],[67,14,67,17],[67,18,67,19],[68,14,68,17],[68,18,68,19],[69,14,69,17],[69,18,69,19],[70,14,70,17],[70,18,70,19],[77,18,77,19],[78,14,78,17],[78,18,78,19],[79,14,79,17],[79,18,79,19],[80,14,80,17],[80,18,80,19],[71,14,71,17],[71,18,71,19],[72,14,72,17],[72,18,72,19],[73,14,73,17],[73,18,73,19],[74,14,74,17],[74,18,74,19],[75,14,75,17],[75,18,75,19],[91,18,91,19],[92,14,92,17],[92,18,92,19],[33,0,33,19],[86,18,86,19],[87,14,87,17],[87,18,87,19],[88,14,88,17],[88,18,88,19],[89,14,89,17],[89,18,89,19],[90,14,90,17],[90,18,90,19],[81,14,81,17],[81,18,81,19],[82,14,82,17],[82,18,82,19],[83,14,83,17],[83,18,83,19],[84,14,84,17],[84,18,84,19],[85,14,85,17],[85,18,85,19],[76,18,76,19]]}
[null,null,null,null,"School Division:",null,{"$f":"'Title III Budget'!$A$16","v":"ALBEMARLE COUNTY PUBLIC SCHOOLS"},null,null,null,null,null,null,null,null,null,null,"Division Number:",null,{"$f":"'Title III Budget'!$H$16","v":2}]
["K.  PRIVATE SCHOOL PARTICIPATION"]
[]
["Each year, the school division must contact all eligible private (nonprofit) schools and engage in meaningful consultation on the availability of equitable services funded by Title III, Part A. (ESEA Title VIII  Uniform Provisions, Part F, Subpart 1)."]
["1. Are there eligible private schools in the school division's attendance area?"]
[null,null,"X","Yes (If yes, complete the remainder of this page.)",null,null,null,null,null,null,null,null,"No (If no, it is not necessary to complete the rest of this page.)"]
[]
["2. Place an \"X\" in the appropriate block(s) to indicate how private schools were notified of the availability of equitable services funded by Title III, Part A. (Copies of the notification must be kept on file for monitoring purposes.)"]
[]
[null,null,"Regular Mail",null,null,null,null,null,null,"X","Certified Mail"]
[]
[null,null,"Telephone Calls",null,null,null,null,null,null,"X","Meetings"]
[]
[null,null,"Visits to the Private School",null,null,null,null,null,null,"X","Other (Please specify)",null,null,"Zoom meetings, email"]
[]
["3. How many English Learners Level 1-4.3 received services in the public school division for the 2019-2020 school year?",null,null,null,null,null,null,null,null,null,null,null,null,null,null,1072]
[]
["4. Determining Set-Asides (These fields will calculate automatically once enrollment figures have been entered.)"]
[null,"a. Title III Budget",null,null,null,null,null,null,null,null,null,{"$f":"SUM('Title III Budget'!G131:J131)","v":105852}]
[null,"b. Proportionate Share",null,null,null,null,null,null,null,null,null,{"$f":"(L19)*(H92/(P16+H92))","v":686.71362372567194}]
[null,"c. Additional set-aside for equitable services (if necessary)"]
[null,"d. Amount to use for set-aside calculations",null,null,null,null,null,null,null,null,null,{"$f":"SUM(L20+L21)","v":686.71362372567194}]
[]
["5. Determining additional set-asides as a result of Transferability. These fields will calculate automatically once budget and enrollment figures have been entered."]
[null,"a. Title III Budget",null,null,null,null,null,null,null,null,null,{"$f":"SUM(Transferability!K13:L13)","v":0}]
[null,"b. Proportionate Share",null,null,null,null,null,null,null,null,null,{"$f":"(L25)*(H92/(P16+H92))","v":0}]
[]
[]
["6. For the 2020-2021 award year, enter the estimated private school-set aside onto the Title III Budget tab under the “Budget for 2020-2021” column in the appropriate object codes on the “Private School Set-Aside” lines.  On the Budget Detail pages, list the amounts in the appropriate object codes in the “Private School Set-Aside for 2020-2021” lines."]
["Page 32"]
[null,null,null,null,"School Division:",null,{"$f":"'Title III Budget'!$A$16","v":"ALBEMARLE COUNTY PUBLIC SCHOOLS"},null,null,null,null,null,null,null,null,null,null,"Division Number:",null,{"$f":"'Title III Budget'!$H$16","v":2}]
["K.  PRIVATE SCHOOL PARTICIPATION (CONTINUED)"]
[]
["7. Complete the chart below:\n• In Column A, list all eligible private schools in the school division.\n• In column B, indicate the participation status of the listed private school(s) for the 2020-2021 award year, as a result of consultation.\n• In Column C, enter number of English learner students in private schools participating in services for the 2020-2021 award year.\n• In Column D, enter the description of services provided for participating children.\n• Columns E and F will automatically calculate the value of services for the 2020-2021 award year."]
[]
["A",null,null,null,null,"B",null,"C",null,"D",null,null,null,null,"E",null,null,null,"F"]
[" Private Schools",null,null,null,null,"Participation Status for 2020-2021 Award Year?\n(Yes/No)  ",null,"Number of Identified Students",null,"Description of Services",null,null,null,null," Estimated Value of Services from 2020-2021 Title IIIA Budget, Per School",null,null,null,"Estimated Value of Additional Services from Transferability Funds"]
["Community Christian Academy",null,null,null,null,"Yes",null,7,null,"ACPS PD, consultation, webinars, and materials",null,null,null,null,{"$f":"ROUND(IF(F38=\"Yes\",H38*$H$93,0),2)","v":686.71},null,null,null,{"$f":"ROUND(IF(F38=\"Yes\",H38*$H$94,0),2)","v":0}]
["Miller School of Albemarle",null,null,null,null,"Yes",null,0,null,"Consultation and ACPS PD",null,null,null,null,{"$f":"ROUND(IF(F39=\"Yes\",H39*$H$93,0),2)","v":0},null,null,null,{"$f":"ROUND(IF(F39=\"Yes\",H39*$H$94,0),2)","v":0}]
["Tandem Friends School",null,null,null,null,"Yes",null,0,null,"Consultation and ACPS PD",null,null,null,null,{"$f":"ROUND(IF(F40=\"Yes\",H40*$H$93,0),2)","v":0},null,null,null,{"$f":"ROUND(IF(F40=\"Yes\",H40*$H$94,0),2)","v":0}]
["Charlottesville Catholic School",null,null,null,null,"No",null,null,null,null,null,null,null,null,0,null,null,null,0]
["Charlottesville Waldorf",null,null,null,null,"No",null,null,null,null,null,null,null,null,0,null,null,null,0]
["The Covenant School",null,null,null,null,"No",null,null,null,null,null,null,null,null,0,null,null,null,0]
["Field School of Charlottesville",null,null,null,null,"No",null,null,null,null,null,null,null,null,0,null,null,null,0]
["Free Union Country School",null,null,null,null,"No",null,null,null,null,null,null,null,null,0,null,null,null,0]
["Little Keswick School",null,null,null,null,"No",null,null,null,null,null,null,null,null,0,null,null,null,0]
["Mountaintop Montessori School",null,null,null,null,"No",null,null,null,null,null,null,null,null,0,null,null,null,0]
["Peabody School",null,null,null,null,"No",null,null,null,null,null,null,null,null,0,null,null,null,0]
["St. Anne's Belfield",null,null,null,null,"No",null,null,null,null,null,null,null,null,0,null,null,null,0]
["University Montessori School",null,null,null,null,"No",null,null,null,null,null,null,null,null,0,null,null,null,0]
[null,null,null,null,null,null,null,null,null,null,null,null,null,null,0,null,null,null,0]
[null,null,null,null,null,null,null,null,null,null,null,null,null,null,0,null,null,null,0]
[null,null,null,null,null,null,null,null,null,null,null,null,null,null,0,null,null,null,0]
[null,null,null,null,null,null,null,null,null,null,null,null,null,null,0,null,null,null,0]
[null,null,null,null,null,null,null,null,null,null,null,null,null,null,0,null,null,null,0]
[null,null,null,null,null,null,null,null,null,null,null,null,null,null,0,null,null,null,0]
[null,null,null,null,null,null,null,null,null,null,null,null,null,null,0,null,null,null,0]
[null,null,null,null,null,null,null,null,null,null,null,null,null,null,0,null,null,null,0]
[null,null,null,null,null,null,null,null,null,null,null,null,null,null,0,null,null,null,0]
[null,null,null,null,null,null,null,null,null,null,null,null,null,null,0,null,null,null,0]
[null,null,null,null,null,null,null,null,null,null,null,null,null,null,0,null,null,null,0]
[null,null,null,null,null,null,null,null,null,null,null,null,null,null,0,null,null,null,0]
[null,null,null,null,null,null,null,null,null,null,null,null,null,null,0,null,null,null,0]
[null,null,null,null,null,null,null,null,null,null,null,null,null,null,0,null,null,null,0]
[null,null,null,null,null,null,null,null,null,null,null,null,null,null,0,null,null,null,0]
[null,null,null,null,null,null,null,null,null,null,null,null,null,null,0,null,null,null,0]
[null,null,null,null,null,null,null,null,null,null,null,null,null,null,0,null,null,null,0]
[null,null,null,null,null,null,null,null,null,null,null,null,null,null,0,null,null,null,0]
[null,null,null,null,null,null,null,null,null,null,null,null,null,null,0,null,null,null,0]
[null,null,null,null,null,null,null,null,null,null,null,null,null,null,0,null,null,null,0]
[null,null,null,null,null,null,null,null,null,null,null,null,null,null,0,null,null,null,0]
[null,null,null,null,null,null,null,null,null,null,null,null,null,null,0,null,null,null,0]
[null,null,null,null,null,null,null,null,null,null,null,null,null,null,0,null,null,null,0]
[null,null,null,null,null,null,null,null,null,null,null,null,null,null,0,null,null,null,0]
[null,null,null,null,null,null,null,null,null,null,null,null,null,null,0,null,null,null,0]
[null,null,null,null,null,null,null,null,null,null,null,null,null,null,0,null,null,null,0]
[null,null,null,null,null,null,null,null,null,null,null,null,null,null,0,null,null,null,0]
[null,null,null,null,null,null,null,null,null,null,null,null,null,null,0,null,null,null,0]
[null,null,null,null,null,null,null,null,null,null,null,null,null,null,0,null,null,null,0]
[null,null,null,null,null,null,null,null,null,null,null,null,null,null,0,null,null,null,0]
[null,null,null,null,null,null,null,null,null,null,null,null,null,null,0,null,null,null,0]
[null,null,null,null,null,null,null,null,null,null,null,null,null,null,0,null,null,null,0]
[null,null,null,null,null,null,null,null,null,null,null,null,null,null,0,null,null,null,0]
[null,null,null,null,null,null,null,null,null,null,null,null,null,null,0,null,null,null,0]
[null,null,null,null,null,null,null,null,null,null,null,null,null,null,0,null,null,null,0]
[null,null,null,null,null,null,null,null,null,null,null,null,null,null,0,null,null,null,0]
[null,null,null,null,null,null,null,null,null,null,null,null,null,null,0,null,null,null,0]
[null,null,null,null,null,null,null,null,null,null,null,null,null,null,0,null,null,null,0]
[null,null,null,null,null,null,null,null,null,null,null,null,null,null,0,null,null,null,0]
[null,null,null,null,null,null,null,null,null,null,null,null,null,null,0,null,null,null,0]
[null,null,null,null,null,null,null,null,null,null,null,null,null,null,0,null,null,null,0]
["Total Identified Students",null,null,null,null,null,null,{"$f":"SUM(H38:I91)","v":7},null,"Total Private School Set-Asides",null,null,null,null,{"$f":"SUM(O38:P91)","v":686.71},null,null,null,{"$f":"SUM(S38:S91)","v":0}]
["Per Pupil Expenditure \n(calculated field):          ",null,null,null,null,null,null,{"$f":"(L22/H92)","v":98.101946246524562},null,null,null,null,null,null,"Use this Figure for Private School Set-Asides in 2020-2021 Budget",null,null,null,"Use this Figure for Private School Set-Asides in 2020-2021 Transferability Budget "]
["Per Pupil Expenditure for Transferability funds (calculated field):          \n\n\n",null,null,null,null,null,null,{"$f":"(L26/H92)","v":0}]
["Page 33"]

{"sheet":"GEPA","index":5,"n_rows":9,"n_cols":16,"rows_kept":9,"cut":false,"hidden":false,"merged":[[7,0,7,15],[0,3,0,5],[1,0,1,15],[3,0,3,15],[5,0,5,15],[6,0,6,15],[8,0,8,15],[10,5,10,6],[10,7,10,8],[10,9,10,10],[11,5,11,6],[11,7,11,8],[11,9,11,10],[12,5,12,6],[12,7,12,8],[12,9,12,10],[13,5,13,6],[13,7,13,8],[13,9,13,10]]}
[null,null,null,"School Division:",null,null,{"$f":"'Title III Budget'!A16","v":"ALBEMARLE COUNTY PUBLIC SCHOOLS"},null,null,null,null,null,"Division Number:",null,null,{"$f":"'Title III Budget'!H16","v":2}]
["L.  GENERAL EDUCATION PROVISIONS ACT (GEPA) SECTION 427"]
[]
["Section 427 of the General Education Provisions Act (GEPA) requires applicants for federal funds to include in their applications a description of the steps the applicant will take to ensure equitable access to, and participation in, federally-assisted programs for students, teachers, and other program beneficiaries with special needs. The provision allows applicants discretion in developing the required description. The statute highlights six types of barriers that can impede equitable access or participation: gender, race, national origin, color, disability, or age. Based on local circumstances, the applicant should determine whether these or other barriers may prevent students, teachers, etc., from such access or participation in the federally-funded project or activity. The description in the application of steps to be taken to overcome these barriers need not be lengthy; the application may provide a clear and succinct description of how the applicant plans to address those barriers that are applicable to their circumstances."]
[]
["Describe the steps the division will take to ensure equitable access to, and participation in, grant-funded programs for students, teachers, and other program beneficiaries with special needs as required by the General Education Provisions Act (GEPA) 427, OMB Control No. 1894-00045, Section 427."]
["Albemarle County is committed to providing equitable access for students, teachers and families in all grant-funded programs and opportunities as required by GEPA 427: \n\n1.Ensuring all events are held in handicapped accessible facilities in geographically convenient locations. Events are held during the day, evening, and on weekends to accommodate family school/work schedules in order to maximize participation.\n2. Materials provided are accessible for literate and non-readers as well as in electronic and paper copy formats to inform families that may not have access to social media and email. This includes translation of documents into Spanish and other languages as needed. The ESOL Office annually vets, hires and trains additional interpreters and translators to ensure a high-level of quality with a personalized experience for families.  Simultaneous interpretation equipment is used in large-group settings, and InterpreTalk Language Line services are used when necessary. \n "]
[" \n3.Albemarle County conducts a variety of outreach programs to address gender and/or race inequalities. Some of these include: Teacher summer reading project, Girls in STEM initiatives, Summer Immersion Excursion programs for newcomers, Camp Invention modules, CoderDojo, World Peace Game, and Saturday family engagement experiences to STEM fairs and other local attractions. \n4.Efforts to involve diverse stakeholders in program planning and implementation are robust and include seventeen diverse teams. Advisory groups include Parent Council, Student Advisory, Special Education, Gifted, Title I, and Diversity and Equity.  Last but certainly not least, the Title I, Title III, Migrant and Homeless Coordinators all meet monthly with the Director of Federal Programs to collaborate and ensure our students have equitable access to all division opportunities. \n5. Lastly, as set forth on our Human Resources website \"hiring for Albemarle County shall be accomplished without regard to race, color, religion, national origin, gender, pregnancy, childbirth or related medical conditions, age, marital status or disability unless otherwise permitted by County policy or applicable law\"."]
["Page 34"]

{"sheet":"General Assurances","index":6,"n_rows":47,"n_cols":16,"rows_kept":47,"cut":false,"hidden":false,"merged":[[51,5,51,6],[51,7,51,8],[51,9,51,10],[42,2,42,15],[49,5,49,6],[49,7,49,8],[49,9,49,10],[50,5,50,6],[50,7,50,8],[50,9,50,10],[41,2,41,15],[43,1,43,15],[44,1,44,15],[46,0,46,15],[48,5,48,6],[48,7,48,8],[48,9,48,10],[36,3,36,15],[37,4,37,15],[38,4,38,15],[39,4,39,15],[40,3,40,15],[31,3,31,15],[32,3,32,15],[33,3,33,15],[34,3,34,15],[35,3,35,15],[26,3,26,15],[27,3,27,15],[28,0,28,15],[29,3,29,5],[30,0,30,15],[21,3,21,15],[22,3,22,15],[23,3,23,15],[24,3,24,15],[25,3,25,15],[16,2,16,15],[17,2,17,15],[18,3,18,15],[19,3,19,15],[20,3,20,15],[11,0,11,15],[12,1,12,15],[13,1,13,15],[14,1,14,15],[15,1,15,15],[8,0,8,3],[8,4,8,15],[9,0,9,3],[9,4,9,15],[10,0,10,3],[10,4,10,15],[5,0,5,3],[5,4,5,15],[6,0,6,3],[6,4,6,15],[7,0,7,3],[7,4,7,15],[0,3,0,5],[1,0,1,15],[3,0,3,3],[3,4,3,15],[4,0,4,3],[4,4,4,15]]}
[null,null,null,"School Division:",null,null,{"$f":"'Title III Budget'!$A$16","v":"ALBEMARLE COUNTY PUBLIC SCHOOLS"},null,null,null,null,null,"Division Number:",null,null,{"$f":"'Title III Budget'!$H$16","v":2}]
["GENERAL ASSURANCES"]
[]
["Title I, Part A",null,null,null,"Improving Basic Programs Operated by Local Educational Agencies"]
["Title I, Part C",null,null,null,"Education of Migratory  Children"]
["Title I, Part D, Subpart 2",null,null,null,"Prevention and Intervention Programs for Children and Youth Who Are Neglected, Delinquent, or At-Risk"]
["Title II, Part A",null,null,null,"Supporting Effective Instruction"]
["Title III, Part A ",null,null,null,"Language Instruction for English Learners and Immigrant Students"]
["Title IV, Part A",null,null,null,"Student Support and Academic Enrichments Grants"]
["Title V, Part B, Subpart 2",null,null,null,"Rural and Low-Income School Program"]
[]
["The school division/grantee assures:"]
["I.","Each program will be administered in accordance with all applicable statutes, regulations, program plans, and applications;"]
["II.","The control of funds provided under each program and title to property acquired with program funds will be in a public agency, a nonprofit private agency, institution, organization, or an Indian tribe, if the law authorizing the program provides for assistance to those entities;"]
["III.","The public agency, nonprofit private agency, institution, organization, or Indian tribe, will administer the funds and property to the extent required by the authorizing statutes;"]
["IV.","It will adopt and use proper methods of administering each program, including - "]
[null,"A.","The enforcement of any obligations imposed by law on agencies, institutions, organizations, and other recipients responsible for carrying out each program;"]
[null,"B.","The correction of deficiencies in program operations that are identified through audits, monitoring, or evaluation and that:"]
[null,null,"1.","It will maintain fiscal effort in support of free public education;"]
[null,null,"2.","It will provide services with state and local funds that are at least comparable to services provided in schools and areas not receiving special federal funds; "]
[null,null,"3.","The majority of the resources in the school division are derived from nonfederal funds;"]
[null,null,"4.","It is in compliance with the requirements in Title VIII, Section 8524 and has no policy that prevents, or otherwise denies participation in, constitutionally protected prayer in public elementary and secondary schools;"]
[null,null,"5.","It will comply with the audit requirements for each program; "]
[null,null,"6.","The federal funds are used to supplement, not supplant regular nonfederal funds;"]
[null,null,"7.","It will cooperate in carrying out any evaluation of each program conducted by or for the state educational agency, the Secretary, or other federal officials;\n\n"]
[null,null,"8.","It will use such fiscal control and fund accounting procedures as will ensure proper disbursement of, and accounting for, federal funds paid to the applicant under each program;"]
[null,null,"9.","It will submit such reports to the state educational agency (which shall make the reports available to the Governor) and the Secretary of Education as the state educational agency and Secretary may require to enable the state educational agency and the Secretary to perform their duties under each program;\n"]
[null,null,"10.","It will maintain such records for five years, provide such information, and afford such access to the records as the state educational agency (after consultation with the Governor) or the Secretary may reasonably require to carry out the state educational agency’s or the Secretary’s duties; "]
["Page 35"]
[null,null,null,"School Division:",null,null,{"$f":"'Title III Budget'!$A$16","v":"ALBEMARLE COUNTY PUBLIC SCHOOLS"},null,null,null,null,null,"Division Number:",null,null,{"$f":"'Title III Budget'!$H$16","v":2}]
["GENERAL ASSURANCES (CONTINUED)"]
[null,null,"11.","It consulted with teachers, school administrators, parents, members of the community, nonprofit organizations and other interested parties in the development of this plan;"]
[null,null,"12.","It afforded a reasonable opportunity for public comment on the plan or application and considered such comment before the application was submitted;"]
[null,null,"13.","It will provide information in an understandable and uniform format and, to the extent practicable, be provided in a language that the parents can understand;"]
[null,null,"14.","It is in compliance with the requirement regarding equal access to public school facilities as specified in Title VIII, Section 8525;"]
[null,null,"15.","It is in compliance with the requirement regarding the prohibition on aiding and abetting sexual abuse as specified in Title VIII, Section 8546;"]
[null,null,"16.","It will comply with the other application requirements outlined in"]
[null,null,null,null,"Section 8501. Private School Children;"]
[null,null,null,null,"Section 8502. Bypass; and"]
[null,null,null,null,"Section 8521. Maintenance of Effort under Title VIII –Other Provisions;"]
[null,null,"17.","It will ensure that funds are expended in accordance with the school division’s approved application or amended application.  In the event the local division needs to expend funds in any manner other than stipulated in the approved application, the plan must be amended using the amendment process provided by the Department of Education.  The application must be amended before funds can be expended for activities not approved in the original application;"]
[null,"C.","It will collect and disseminate information collected under Section 1111 in a manner that protects the privacy of individuals;\n"]
[null,"D.","It will adhere to the provisions of the Federal Funding Transparency and Accountability Act (FFATA), and will obtain a valid DUNS number prior to applying for funds."]
["V.","It will comply with Section 22.1-277.07, of the Code of Virginia that requires the expulsion for one year of any student determined to have brought a firearm to school.  A description of each incident, the name of the school concerned, the number of students expelled from each school, and the type of firearm used in each instance of expulsion will be reported to the Virginia Department of Education in compliance with provisions under Section 8561 (Gun-Free Schools Act).  This agency has a policy that requires referral to the criminal justice or the juvenile delinquency system of any student who brings a firearm or weapon to school; and"]
["VI.","It will participate, if selected, in the state National Assessment of Educational Progress in 4th and 8th grade reading and mathematics carried out under Section 303 of the National Assessment of Educational Progress Act."]
[]
["Page 36"]

{"sheet":"Program Specific Assurances","index":7,"n_rows":39,"n_cols":16,"rows_kept":39,"cut":false,"hidden":false,"merged":[[43,5,43,6],[43,7,43,8],[43,9,43,10],[41,5,41,6],[41,7,41,8],[41,9,41,10],[42,5,42,6],[42,7,42,8],[42,9,42,10],[38,0,38,15],[40,5,40,6],[40,7,40,8],[40,9,40,10],[32,1,32,15],[33,1,33,15],[34,1,34,15],[35,1,35,15],[36,1,36,15],[12,3,12,15],[13,3,13,15],[14,3,14,15],[15,3,15,15],[5,1,5,15],[0,3,0,5],[1,0,1,15],[7,0,7,15],[8,1,8,15],[11,2,11,15],[3,0,3,15],[10,1,10,15],[9,1,9,15],[6,1,6,15],[30,1,30,15],[31,1,31,15],[24,0,24,15],[25,3,25,5],[26,0,26,15],[28,2,28,15],[29,1,29,15],[16,3,16,15],[17,3,17,15],[18,3,18,15],[19,3,19,15],[23,4,23,15],[20,4,20,15],[21,5,21,15],[22,5,22,15]]}
[null,null,null,"School Division:",null,null,{"$f":"'Title III Budget'!$A$16","v":"ALBEMARLE COUNTY PUBLIC SCHOOLS"},null,null,null,null,null,"Division Number:",null,null,{"$f":"'Title III Budget'!$H$16","v":2}]
["PROGRAM SPECIFIC ASSURANCES"]
[]
["Title III funds cannot be used for academic programs and LIEP services provided to ELs that are required under other local, state, and federal laws to include Title VI of the Civil Rights Act of 1964, the Equal Educational Opportunities Act of 1974 (EEOA). The division will comply with the supplement, not supplant, provisions as described below: \n"]
[]
[null,"Section 3115"]
[null,"(g) SUPPLEMENT, NOT SUPPLANT - Federal funds made available under this subpart shall be used so as to supplement the level of federal, state, and local public funds that, in the absence of such availability, would have been expended for programs for English learners and immigrant children and youth and in no case to supplant such Federal, State, and local public funds."]
["The school division/grantee assures:"]
["I.","It will include in the plan under ESEA Section 3114 a certification that all teachers in any LIEP are, or will be, funded under this part are fluent in English and any other language used for instruction, including having written and oral communications skills;"]
["II.","All ELs will be identified within 30 days of enrollment"]
["III.","It will comply with the parental notification requirements as described below:"]
[null,"A.","Each eligible entity using funds provided under this title to provide a LIEP shall, not later than 30 days after the beginning of the school year, inform a parent or the parents of ELs identified for participation in, or participating in, such program of — "]
[null,null,"1.","the reasons for the identification of their child as an EL and in need of placement in a LIEP;"]
[null,null,"2.","the child’s level of English proficiency, how such level was assessed, and the status of the child’s academic achievement;"]
[null,null,"3.","the method of instruction used in the program in which their child is, or will be, participating, and the methods of instruction used in other available programs, including how such programs differ in content, instruction goals, and use of English and a native language in instruction;"]
[null,null,"4.","how the program in which their child is, or will be participating, will meet the educational strengths and needs of the child;"]
[null,null,"5.","how such program will specifically help their child learn English, and meet age appropriate academic achievement standards for grade promotion and graduation;"]
[null,null,"6.","the specific exit requirements for such program, the expected rate of transition from such program into classrooms that are not tailored for ELs, and the expected rate of graduation from secondary school for such program if funds under this title are used for children in secondary schools;"]
[null,null,"7.","in the case of a child with a disability, how such program meets the objectives of the individualized education program of the child; and"]
[null,null,"8.","information pertaining to parental rights that includes written guidance — "]
[null,null,null,"a.","a. detailing —"]
[null,null,null,null,"(i).","the right that parents have to have their child immediately removed from such program upon their request; and"]
[null,null,null,null,"(ii).","the options that parents have to decline to enroll their child in such program or to choose another program or method of instruction, if available; and"]
[null,null,null,"b.","assisting parents in selecting among various programs and methods of instruction, if more than one program or method is offered by the eligible entity."]
["Page 37"]
[null,null,null,"School Division:",null,null,{"$f":"'Title III Budget'!$A$16","v":"ALBEMARLE COUNTY PUBLIC SCHOOLS"},null,null,null,null,null,"Division Number:",null,null,{"$f":"'Title III Budget'!$H$16","v":2}]
["PROGRAM SPECIFIC ASSURANCES (CONTINUED)"]
[]
[null,"B.","RECEIPT OF INFORMATION- The information required to be provided under subsection (a) to a parent shall be provided in an understandable and uniform format and, to the extent practicable, in a language that the parent can understand."]
["IV.","It will comply with the Parents Right-to-Know requirements in ESEA Section 1112(e);"]
["V.","It will annually assess the English proficiency of all ELs participating in programs funded under this part;"]
["VI."," It will base its proposed plan on effective research on teaching ELs;"]
["VII.","It will ensure that the programs will enable children to speak, read, write, and comprehend the English language and meet challenging state academic content and student academic achievement standards; "]
["VIII."," It will not violate any state law, including state constitutional law, regarding the education of ELs, consistent with ESEA Sections 3125 and 3126; "]
["IX.","It consulted with teachers, researchers, school administrators and other school personnel, parents and family members, community members, public or private entities, institutions of higher education, and other stakeholders in developing the Title III local plan described in the program overview section;"]
["X.","It will, if applicable, coordinate activities and share relevant data under the plan with local Head Start agencies, including migrant and seasonal Head Start agencies, and other early childhood education providers; and"]
["XI.","Immigrant children and youth (IY) funds will be specifically targeted to eligible immigrant students and their families.\n"]
[]
["Page 38"]

{"sheet":"Prefills","index":8,"n_rows":288,"n_cols":61,"rows_kept":288,"cut":false,"hidden":true,"merged":[]}
["Name","Code",null,null,null,null,null,null,"INNOVATIVE ASSISTANCE PROGRAM AREAS",null,null,null,null,null,null,null,null,null,null,null,"Yes",null,"Yes",null,null,"Title I A",null,null,null,"Title I C",null,null,null,"Title ID",null,null,null,"Title IIA",null,null,null,"Title IID",null,null,null,"Title III",null,null,null,"Title IV",null,null,null,"Title V",null,null,null,"Title VI"]
["ACCOMACK COUNTY PUBLIC SCHOOLS",1,null,null,null,null,null,null,null,null,null,null,null,null,null,null,null,null,null,null,"No",null,"No",null,null,"Payee","ProjectGroupID","CONoSOLIDATED_APP_FLAG","Allocation","Payee","ProjectGroupID","CONoSOLIDATED_APP_FLAG","Allocation","Payee","ProjectGroupID","CONoSOLIDATED_APP_FLAG","Allocation","Payee","ProjectGroupID","CONoSOLIDATED_APP_FLAG","Allocation","Payee","ProjectGroupID","CONoSOLIDATED_APP_FLAG","Allocation","Payee","ProjectGroupID","CONoSOLIDATED_APP_FLAG","Allocation","Payee","ProjectGroupID","CONoSOLIDATED_APP_FLAG","Allocation","Payee","ProjectGroupID","CONoSOLIDATED_APP_FLAG","Allocation","Payee","ProjectGroupID","CONoSOLIDATED_APP_FLAG","Allocation"]
["ALBEMARLE COUNTY PUBLIC SCHOOLS",2,null,null,null,null,null," "," ",null,null,null,null,null,null,null,null,null,null,null,null,null,"Shared Services Only",null,null,1,1,"Yes",null,1,2,"Yes",null,1,3,"Yes",null,1,4,"Yes",null,null,null,null,null,1,6,"Yes",81902.75,1,97,null,null,null,null,null,null,1,9,"Yes"]
["ALEXANDRIA CITY PUBLIC SCHOOLS",101,null,null,null,null,null,"1. ","1. Recruiting, training, and hiring highly qualified teachers to reduce class size",null,null,null,null,null,null,null,null,null,null,null,null,null,null,null,null,2,1,"No",null,2,2,"No",null,2,3,"No",null,2,4,"No",null,null,null,null,null,2,6,"No",117426.86,2,97,null,null,null,null,null,null,2,9,"No"]
["ALLEGHANY COUNTY PUBLIC SCHOOLS",3,null,null,null,null,null,"2. ","2. Technology activities, including professional development",null,null,null,null,null,null,null,null,null,null,null,null,null,null,null,null,3,1,"Yes",null,3,2,"Yes",null,3,3,"Yes",null,3,4,"Yes",null,null,null,null,null,3,6,"Yes",790.79000000000008,3,97,null,null,null,null,null,null,3,9,"Yes"]
["AMELIA COUNTY PUBLIC SCHOOLS",4,null,null,null,null,null,"3a.","3a. Development or acquisition and use of: computer software and hardware",null,null,null,null,null,null,null,null,null,null,null,null,null,"Yes",null,null,4,1,"Yes",null,4,2,"Yes",null,4,3,"Yes",null,4,4,"Yes",null,null,null,null,null,4,6,"Yes",3840.95,4,97,null,null,null,null,null,null,4,9,"Yes"]
["AMHERST COUNTY PUBLIC SCHOOLS",5,null,null,null,null,null,"3b.","3b. Development or acquisition and use of: instructional/reference materials and academic assessments",null,null,null,null,null,null,null,null,null,null,null,null,null,"No",null,null,5,1,"No",null,5,2,"No",null,5,3,"No",null,5,4,"No",null,null,null,null,null,5,6,"No",2711.2599999999998,5,97,null,null,null,null,null,null,5,9,"No"]
["APPOMATTOX COUNTY PUBLIC SCHOOLS",6,null,null,null,null,null,"3c.","3c. Development or acquisition and use of: library/media services and materials",null,null,null,null,null,null,null,null,null,null,null,null,null,null,null,null,6,1,"No",null,6,2,"No",null,6,3,"No",null,6,4,"No",null,null,null,null,null,6,6,"No",0,6,97,null,null,null,null,null,null,6,9,"No"]
["ARLINGTON COUNTY PUBLIC SCHOOLS",7,null,null,null,null,null,"4. ","4. Educational reform projects, including magnet schools",null,null,null,null,null,null,null,null,null,null,null,null,null,null,null,null,7,1,"Yes",null,7,2,"Yes",null,7,3,"Yes",null,7,4,"Yes",null,null,null,null,null,7,6,"Yes",550499.47,7,97,null,null,null,null,null,null,7,9,"Yes"]
["AUGUSTA COUNTY PUBLIC SCHOOLS",8,null,null,null,null,null,"5. ","5. Programs to improve the academic achievement of educationally disadvantaged elementary and secondary students, including dropout prevention",null,null,null,null,null,null,null,null,null,null,null,null,null,null,null,null,8,1,"No",null,8,2,"No",null,8,3,"No",null,8,4,"No",null,null,null,null,null,8,6,"No",15589.76,8,97,null,null,null,null,null,null,8,9,"No"]
["BATH COUNTY PUBLIC SCHOOLS",9,null,null,null,null,null,"6. ","6. Programs to improve the literacy skills of adults, including adult education and family literacy programs",null,null,null,null,null,null,null,null,null,null,null,null,null,null,null,null,9,1,"No",null,9,2,"No",null,9,3,"No",null,9,4,"No",null,null,null,null,null,9,6,"No",677.82,9,97,null,null,null,null,null,null,9,9,"No"]
["BEDFORD CITY PUBLIC SCHOOLS",140,null,null,null,null,null,"7. ","7. Programs for gifted and talented children",null,null,null,null,null,null,null,null,null,null,null,null,null,null,null,null,10,1,"No",null,10,2,"No",null,10,3,"No",null,10,4,"No",null,null,null,null,null,10,6,"No",7681.92,10,97,null,null,null,null,null,null,10,9,"No"]
["BEDFORD COUNTY PUBLIC SCHOOLS",10,null,null,null,null,null,"8. ","8. Planning, design, and initial implementation of charter schools under Title V, Part B",null,null,null,null,null,null,null,null,null,null,null,null,null,null,null,null,11,1,"Yes",null,11,2,"Yes",null,11,3,"Yes",null,11,4,"Yes",null,null,null,null,null,11,6,"Yes",0,11,97,null,null,null,null,null,null,11,9,"Yes"]
["BLAND COUNTY PUBLIC SCHOOLS",11,null,null,null,null,null,"9. ","9. School improvement programs or activities under Sections 1116 and 1117 of Title I, Part A",null,null,null,null,null,null,null,null,null,null,null,null,null,null,null,null,12,1,"No",null,12,2,"No",null,12,3,"No",null,12,4,"No",null,null,null,null,null,12,6,"No",8246.76,12,97,null,null,null,null,null,null,12,9,"No"]
["BOTETOURT COUNTY PUBLIC SCHOOLS",12,null,null,null,null,null,"10.","10. Community service programs",null,null,null,null,null,null,null,null,null,null,null,null,null,null,null,null,13,1,"Yes",null,13,2,"Yes",null,13,3,"Yes",null,13,4,"Yes",null,null,null,null,null,13,6,"Yes",3615.02,13,97,null,null,null,null,null,null,13,9,"Yes"]
["BRISTOL CITY PUBLIC SCHOOLS",102,null,null,null,null,null,"11.","11. Consumer, economic, and personal finance education",null,null,null,null,null,null,null,null,null,null,null,null,null,null,null,null,14,1,"Yes",null,14,2,"Yes",null,14,3,"Yes",null,14,4,"Yes",null,null,null,null,null,14,6,"Yes",225.94,14,97,null,null,null,null,null,null,14,9,"Yes"]
["BRUNSWICK COUNTY PUBLIC SCHOOLS",13,null,null,null,null,null,"12.","12. Public school choice",null,null,null,null,null,null,null,null,null,null,null,null,null,1000,null,null,15,1,"Yes",null,15,2,"Yes",null,15,3,"Yes",null,15,4,"Yes",null,null,null,null,null,15,6,"Yes",451.88,15,97,null,null,null,null,null,null,15,9,"Yes"]
["BUCHANAN COUNTY PUBLIC SCHOOLS",14,null,null,null,null,null,"13.","13. Programs to hire and support school nurses",null,null,null,null,null,null,null,null,null,null,null,null,null,2000,null,null,16,1,"No",null,16,2,"No",null,16,3,"No",null,16,4,"No",null,null,null,null,null,16,6,"No",18526.97,16,97,null,null,null,null,null,null,16,9,"No"]
["BUCKINGHAM COUNTY PUBLIC SCHOOLS",15,null,null,null,null,null,"14.","14. School-based mental health services",null,null,null,null,null,null,null,null,null,null,null,null,null,3000,null,null,17,1,"Yes",null,17,2,"Yes",null,17,3,"Yes",null,17,4,"Yes",null,null,null,null,null,17,6,"Yes",8359.73,17,97,null,null,null,null,null,null,17,9,"Yes"]
["BUENA VISTA CITY PUBLIC SCHOOLS",103,null,null,null,null,null,"15.","15. Alternative educational programs",null,null,null,null,null,null,null,null,null,null,null,null,null,4000,null,null,18,1,"No",null,18,2,"No",null,18,3,"No",null,18,4,"No",null,null,null,null,null,18,6,"No",11183.96,18,97,null,null,null,null,null,null,18,9,"No"]
["CAMPBELL COUNTY PUBLIC SCHOOLS",16,null,null,null,null,null,"16.","16. Prekindergarten programs",null,null,null,null,null,null,null,null,null,null,null,null,null,5000,null,null,19,1,"Yes",null,19,2,"Yes",null,19,3,"Yes",null,19,4,"Yes",null,null,null,null,null,19,6,"Yes",225.94,19,97,null,null,null,null,null,null,19,9,"Yes"]
["CAROLINE COUNTY PUBLIC SCHOOLS",17,null,null,null,null,null,"17.","17. Academic intervention programs jointly operated with community-based organizations ",null,null,null,null,null,null,null,null,null,null,null,null,null,6000,null,null,20,1,"Yes",null,20,2,"Yes",null,20,3,"Yes",null,20,4,"Yes",null,null,null,null,null,20,6,"Yes",1355.64,20,97,null,null,null,null,null,null,20,9,"Yes"]
["CARROLL COUNTY PUBLIC SCHOOLS",18,null,null,null,null,null,"18.","18. CPR training",null,null,null,null,null,null,null,null,null,null,null,null,null,8000,null,null,21,1,"No",null,21,2,"No",null,21,3,"No",null,21,4,"No",null,null,null,null,null,21,6,"No",438398.25999999995,21,97,null,null,null,null,null,null,21,9,"No"]
["CHARLES CITY COUNTY PUBLIC SCHOOLS",19,null,null,null,null,null,"19.","19. Smaller learning communities",null,null,null,null,null,null,null,null,null,null,null,null,null,null,null,null,22,1,"No",null,22,2,"No",null,22,3,"No",null,22,4,"No",null,null,null,null,null,22,6,"No",6778.16,22,97,null,null,null,null,null,null,22,9,"No"]
["CHARLOTTE COUNTY PUBLIC SCHOOLS",20,null,null,null,null,null,"20.","20. Activities that encourage and expand improvements throughout the LEA area that  are designed to advance student academic achievement",null,null,null,null,null,null,null,null,null,null,null,null,null,null,null,null,23,1,"Yes",null,23,2,"Yes",null,23,3,"Yes",null,23,4,"Yes",null,null,null,null,null,23,6,"Yes",0,23,97,null,null,null,null,null,null,23,9,"Yes"]
["CHARLOTTESVILLE CITY PUBLIC SCHOOLS",104,null,null,null,null,null,"21.","21. Parental and community involvement",null,null,null,null,null,null,null,null,null,null,null,null,null,null,null,null,24,1,"No",null,24,2,"No",null,24,3,"No",null,24,4,"No",null,null,null,null,null,24,6,"No",89526.549999999988,24,97,null,null,null,null,null,null,24,9,"No"]
["CHESAPEAKE CITY PUBLIC SCHOOLS",136,null,null,null,null,null,"22.","22. Activities that expand learning through best-practice models",null,null,null,null,null,null,null,null,null,null,null,null,null,null,null,null,25,1,"Yes",null,25,2,"Yes",null,25,3,"Yes",null,25,4,"Yes",null,null,null,null,null,25,6,"Yes",2372.36,25,97,null,null,null,null,null,null,25,9,"Yes"]
["CHESTERFIELD COUNTY PUBLIC SCHOOLS",21,null,null,null,null,null,"23.","23. Same-gender schools and classrooms (consistent with applicable law)**",null,null,null,null,null,null,null,null,null,null,null,null,null,null,null,null,26,1,"No",null,26,2,"No",null,26,3,"No",null,26,4,"No",null,null,null,null,null,26,6,"No",451.88,26,97,null,null,null,null,null,null,26,9,"No"]
["CLARKE COUNTY PUBLIC SCHOOLS",22,null,null,null,null,null,"24.","24. Service learning activities",null,null,null,null,null,null,null,null,null,null,null,null,null,null,null,null,27,1,"Yes",null,27,2,"Yes",null,27,3,"Yes",null,27,4,"Yes",null,null,null,null,null,27,6,"Yes",7230.04,27,97,null,null,null,null,null,null,27,9,"Yes"]
["CLIFTON FORGE CITY",105,null,null,null,null,null,"25.","25. School safety programs",null,null,null,null,null,null,null,null,null,null,null,null,null,null,null,null,28,1,"No",null,28,2,"No",null,28,3,"No",null,28,4,"No",null,null,null,null,null,28,6,"No",3389.08,28,97,null,null,null,null,null,null,28,9,"No"]
["COLONIAL BEACH TOWN PUBLIC SCHOOLS",202,null,null,null,null,null,"26.","26. Programs that use research-based cognitive and perceptual development approaches",null,null,null,null,null,null,null,null,null,null,null,null,null,null,null,null,29,1,"No",null,29,2,"No",null,29,3,"No",null,29,4,"No",null,null,null,null,null,29,6,"No",4309782.1500000004,29,97,null,null,null,null,null,null,29,9,"No"]
["COLONIAL HEIGHTS CITY PUBLIC SCHOOLS",106,null,null,null,null,null,"27.","27. Supplemental educational services as defined in Section 1116(e) of Title I, Part A",null,null,null,null,null,null,null,null,null,null,null,null,null,null,null,null,30,1,"Yes",null,30,2,"Yes",null,30,3,"Yes",null,30,4,"Yes",null,null,null,null,null,30,6,"Yes",82222.569999999992,30,97,null,null,null,null,null,null,30,9,"Yes"]
["COVINGTON CITY PUBLIC SCHOOLS",107,null,null,null,null,null,null,"Program Administration",null,null,null,null,null,null,null,null,null,null,null,null,null,null,null,null,31,1,"Yes",null,31,2,"Yes",null,31,3,"Yes",null,31,4,"Yes",null,null,null,null,null,31,6,"Yes",3953.9199999999996,31,97,null,null,null,null,null,null,31,9,"Yes"]
["CRAIG COUNTY PUBLIC SCHOOLS",23,null,null,null,null,null,null,"Indirect Costs (not to exceed approved rate)",null,null,null,null,null,null,null,null,null,null,null,null,null,null,null,null,32,1,"Yes",null,32,2,"Yes",null,32,3,"Yes",null,32,4,"Yes",null,null,null,null,null,32,6,"Yes",6326.28,32,97,null,null,null,null,null,null,32,9,"Yes"]
["CULPEPER COUNTY PUBLIC SCHOOLS",24,null,null,null,null,null,null,null,null,null,null,null,null,null,null,null,null,null,null,null,null,null,null,null,33,1,"Yes",null,33,2,"Yes",null,33,3,"Yes",null,33,4,"Yes",null,null,null,null,null,33,6,"Yes",15928.68,33,97,null,null,null,null,null,null,33,9,"Yes"]
["CUMBERLAND COUNTY PUBLIC SCHOOLS",25,null,null,null,null,null,null,null,null,null,null,null,null,null,null,null,null,null,null,null,null,null,null,null,34,1,"No",null,34,2,"No",null,34,3,"No",null,34,4,"No",null,null,null,null,null,34,6,"No",80660.09,34,97,null,null,null,null,null,null,34,9,"No"]
["DANVILLE CITY PUBLIC SCHOOLS",108,null,null,null,null,null,null,null,null,null,null,null,null,null,null,null,null,null,null,null,null,null,null,null,35,1,"No",null,35,2,"No",null,35,3,"No",null,35,4,"No",null,null,null,null,null,35,6,"No",0,35,97,null,null,null,null,null,null,35,9,"No"]
["DEPARTMENT OF JUVENILE JUSTICE",917,null,null,null,null,null,null,null,null,null,null,null,null,null,null,null,null,null,null,null,null,null,null,null,36,1,"Yes",null,36,2,"Yes",null,36,3,"Yes",null,36,4,"Yes",null,null,null,null,null,36,6,"Yes",6439.25,36,97,null,null,null,null,null,null,36,9,"Yes"]
["DICKENSON COUNTY PUBLIC SCHOOLS",26,null,null,null,null,null,null,null,null,null,null,null,null,null,null,null,null,null,null,null,null,null,null,null,37,1,"No",null,37,2,"No",null,37,3,"No",null,37,4,"No",null,null,null,null,null,37,6,"No",6100.34,37,97,null,null,null,null,null,null,37,9,"No"]
["DINWIDDIE COUNTY PUBLIC SCHOOLS",27,null,null,null,null,null,null,null,null,null,null,null,null,null,null,null,null,null,null,null,null,null,null,null,38,1,"No",null,38,2,"No",null,38,3,"No",null,38,4,"No",null,null,null,null,null,38,6,"No",1807.51,38,97,null,null,null,null,null,null,38,9,"No"]
["EMPORIA CITY PUBLIC SCHOOLS",138,null,null,null,null,null,null,null,null,null,null,null,null,null,null,null,null,null,null,null,null,null,null,null,39,1,"Yes",null,39,2,"Yes",null,39,3,"Yes",null,39,4,"Yes",null,null,null,null,null,39,6,"Yes",12200.69,39,97,null,null,null,null,null,null,39,9,"Yes"]
["ESSEX COUNTY PUBLIC SCHOOLS",28,null,null,null,null,null,null,null,null,null,null,null,null,null,null,null,null,null,null,null,null,null,null,null,40,1,"Yes",null,40,2,"Yes",null,40,3,"Yes",null,40,4,"Yes",null,null,null,null,null,40,6,"Yes",4744.71,40,97,null,null,null,null,null,null,40,9,"Yes"]
["FAIRFAX CITY PUBLIC SCHOOLS",134,null,null,null,null,null,null,null,null,null,null,null,null,null,null,null,null,null,null,null,null,null,null,null,41,1,"Yes",null,41,2,"Yes",null,41,3,"Yes",null,41,4,"Yes",null,null,null,null,null,41,6,"Yes",5422.53,41,97,null,null,null,null,null,null,41,9,"Yes"]
["FAIRFAX COUNTY PUBLIC SCHOOLS",29,null,null,null,null,null,null,null,null,null,null,null,null,null,null,null,null,null,null,null,null,null,null,null,42,1,"No",null,42,2,"No",null,42,3,"No",null,42,4,"No",null,null,null,null,null,42,6,"No",28581.24,42,97,null,null,null,null,null,null,42,9,"No"]
["FALLS CHURCH CITY PUBLIC SCHOOLS",109,null,null,null,null,null,null,null,null,null,null,null,null,null,null,null,null,null,null,null,null,null,null,null,43,1,"No",null,43,2,"No",null,43,3,"No",null,43,4,"No",null,null,null,null,null,43,6,"No",407236.91,43,97,null,null,null,null,null,null,43,9,"No"]
["FAUQUIER COUNTY PUBLIC SCHOOLS",30,null,null,null,null,null,null,null,null,null,null,null,null,null,null,null,null,null,null,null,null,null,null,null,44,1,"No",null,44,2,"No",null,44,3,"No",null,44,4,"No",null,null,null,null,null,44,6,"No",54790.119999999995,44,97,null,null,null,null,null,null,44,9,"No"]
["FLOYD COUNTY PUBLIC SCHOOLS",31,null,null,null,null,null,null,null,null,null,null,null,null,null,null,null,null,null,null,null,null,null,null,null,45,1,"No",null,45,2,"No",null,45,3,"No",null,45,4,"No",null,null,null,null,null,45,6,"No",0,45,97,null,null,null,null,null,null,45,9,"No"]
["FLUVANNA COUNTY PUBLIC SCHOOLS",32,null,null,null,null,null,null,null,null,null,null,null,null,null,null,null,null,null,null,null,null,null,null,null,46,1,"No",null,46,2,"No",null,46,3,"No",null,46,4,"No",null,null,null,null,null,46,6,"No",4405.7999999999993,46,97,null,null,null,null,null,null,46,9,"No"]
["FRANKLIN CITY PUBLIC SCHOOLS",135,null,null,null,null,null,null,null,null,null,null,null,null,null,null,null,null,null,null,null,null,null,null,null,47,1,null,null,47,2,null,null,47,3,null,null,47,4,null,null,null,null,null,null,47,6,null,null,47,97,null,null,null,null,null,null,47,9]
["FRANKLIN COUNTY PUBLIC SCHOOLS",33,null,null,null,null,null,null,null,null,null,null,null,null,null,null,null,null,null,null,null,null,null,null,null,48,1,"No",null,48,2,"No",null,48,3,"No",null,48,4,"No",null,null,null,null,null,48,6,"No",4066.9,48,97,null,null,null,null,null,null,48,9,"No"]
["FREDERICK COUNTY PUBLIC SCHOOLS",34,null,null,null,null,null,null,null,null,null,null,null,null,null,null,null,null,null,null,null,null,null,null,null,49,1,"Yes",null,49,2,"Yes",null,49,3,"Yes",null,49,4,"Yes",null,null,null,null,null,49,6,"Yes",1129.69,49,97,null,null,null,null,null,null,49,9,"Yes"]
["FREDERICKSBURG CITY PUBLIC SCHOOLS",110,null,null,null,null,null,null,null,null,null,null,null,null,null,null,null,null,null,null,null,null,null,null,null,50,1,"Yes",null,50,2,"Yes",null,50,3,"Yes",null,50,4,"Yes",null,null,null,null,null,50,6,"Yes",2598.3000000000002,50,97,null,null,null,null,null,null,50,9,"Yes"]
["GALAX CITY PUBLIC SCHOOLS",111,null,null,null,null,null,null,null,null,null,null,null,null,null,null,null,null,null,null,null,null,null,null,null,51,1,"Yes",null,51,2,"Yes",null,51,3,"Yes",null,51,4,"Yes",null,null,null,null,null,51,6,"Yes",0,51,97,null,null,null,null,null,null,51,9,"Yes"]
["GILES COUNTY PUBLIC SCHOOLS",35,null,null,null,null,null,null,null,null,null,null,null,null,null,null,null,null,null,null,null,null,null,null,null,52,1,"Yes",null,52,2,"Yes",null,52,3,"Yes",null,52,4,"Yes",null,null,null,null,null,52,6,"Yes",0,52,97,null,null,null,null,null,null,52,9,"Yes"]
["GLOUCESTER COUNTY PUBLIC SCHOOLS",36,null,null,null,null,null,null,null,null,null,null,null,null,null,null,null,null,null,null,null,null,null,null,null,53,1,"Yes",null,53,2,"Yes",null,53,3,"Yes",null,53,4,"Yes",null,null,null,null,null,53,6,"Yes",1076843.3400000001,53,97,null,null,null,null,null,null,53,9,"Yes"]
["GOOCHLAND COUNTY PUBLIC SCHOOLS",37,null,null,null,null,null,null,null,null,null,null,null,null,null,null,null,null,null,null,null,null,null,null,null,54,1,"No",null,54,2,"No",null,54,3,"No",null,54,4,"No",null,null,null,null,null,54,6,"No",11974.74,54,97,null,null,null,null,null,null,54,9,"No"]
["GRAYSON COUNTY PUBLIC SCHOOLS",38,null,null,null,null,null,null,null,null,null,null,null,null,null,null,null,null,null,null,null,null,null,null,null,55,1,"Yes",null,55,2,"Yes",null,55,3,"Yes",null,55,4,"Yes",null,null,null,null,null,55,6,"Yes",10167.23,55,97,null,null,null,null,null,null,55,9,"Yes"]
["GREENE COUNTY PUBLIC SCHOOLS",39,null,null,null,null,null,null,null,null,null,null,null,null,null,null,null,null,null,null,null,null,null,null,null,56,1,"No",null,56,2,"No",null,56,3,"No",null,56,4,"No",null,null,null,null,null,56,6,"No",1694.54,56,97,null,null,null,null,null,null,56,9,"No"]
["GREENSVILLE COUNTY PUBLIC SCHOOLS",40,null,null,null,null,null,null,null,null,null,null,null,null,null,null,null,null,null,null,null,null,null,null,null,57,1,"Yes",null,57,2,"Yes",null,57,3,"Yes",null,57,4,"Yes",null,null,null,null,null,57,6,"Yes",2033.44,57,97,null,null,null,null,null,null,57,9,"Yes"]
["HALIFAX COUNTY PUBLIC SCHOOLS",41,null,null,null,null,null,null,null,null,null,null,null,null,null,null,null,null,null,null,null,null,null,null,null,58,1,"Yes",null,58,2,"Yes",null,58,3,"Yes",null,58,4,"Yes",null,null,null,null,null,58,6,"Yes",5083.62,58,97,null,null,null,null,null,null,58,9,"Yes"]
["HAMPTON CITY PUBLIC SCHOOLS",112,null,null,null,null,null,null,null,null,null,null,null,null,null,null,null,null,null,null,null,null,null,null,null,59,1,"Yes",null,59,2,"Yes",null,59,3,"Yes",null,59,4,"Yes",null,null,null,null,null,59,6,"Yes",1355.64,59,97,null,null,null,null,null,null,59,9,"Yes"]
["HANOVER COUNTY PUBLIC SCHOOLS",42,null,null,null,null,null,null,null,null,null,null,null,null,null,null,null,null,null,null,null,null,null,null,null,60,1,"No",null,60,2,"No",null,60,3,"No",null,60,4,"No",null,null,null,null,null,60,6,"No",42244.360000000008,60,97,null,null,null,null,null,null,60,9,"No"]
["HARRISONBURG CITY PUBLIC SCHOOLS",113,null,null,null,null,null,null,null,null,null,null,null,null,null,null,null,null,null,null,null,null,null,null,null,62,1,"No",null,62,2,"No",null,62,3,"No",null,62,4,"No",null,null,null,null,null,62,6,"No",4518.7700000000004,62,97,null,null,null,null,null,null,62,9,"No"]
["HENRICO COUNTY PUBLIC SCHOOLS",43,null,null,null,null,null,null,null,null,null,null,null,null,null,null,null,null,null,null,null,null,null,null,null,63,1,"Yes",null,63,2,"Yes",null,63,3,"Yes",null,63,4,"Yes",null,null,null,null,null,63,6,"Yes",2711.2599999999998,63,97,null,null,null,null,null,null,63,9,"Yes"]
["HENRY COUNTY PUBLIC SCHOOLS",44,null,null,null,null,null,null,null,null,null,null,null,null,null,null,null,null,null,null,null,null,null,null,null,65,1,"Yes",null,65,2,"Yes",null,65,3,"Yes",null,65,4,"Yes",null,null,null,null,null,65,6,"Yes",16493.52,65,97,null,null,null,null,null,null,65,9,"Yes"]
["HIGHLAND COUNTY PUBLIC SCHOOLS",45,null,null,null,null,null,null,null,null,null,null,null,null,null,null,null,null,null,null,null,null,null,null,null,66,1,"Yes",null,66,2,"Yes",null,66,3,"Yes",null,66,4,"Yes",null,null,null,null,null,66,6,"Yes",2711.2599999999998,66,97,null,null,null,null,null,null,66,9,"Yes"]
["HOPEWELL CITY PUBLIC SCHOOLS",114,null,null,null,null,null,null,null,null,null,null,null,null,null,null,null,null,null,null,null,null,null,null,null,67,1,"Yes",null,67,2,"Yes",null,67,3,"Yes",null,67,4,"Yes",null,null,null,null,null,67,6,"Yes",8811.6099999999988,67,97,null,null,null,null,null,null,67,9,"Yes"]
["ISLE OF WIGHT COUNTY PUBLIC SCHOOLS",46,null,null,null,null,null,null,null,null,null,null,null,null,null,null,null,null,null,null,null,null,null,null,null,68,1,"Yes",null,68,2,"Yes",null,68,3,"Yes",null,68,4,"Yes",null,null,null,null,null,68,6,"Yes",17962.12,68,97,null,null,null,null,null,null,68,9,"Yes"]
["JAMES CITY COUNTY PUBLIC SCHOOLS",47,null,null,null,null,null,null,null,null,null,null,null,null,null,null,null,null,null,null,null,null,null,null,null,69,1,"Yes",null,69,2,"Yes",null,69,3,"Yes",null,69,4,"Yes",null,null,null,null,null,69,6,"Yes",1807.51,69,97,null,null,null,null,null,null,69,9,"Yes"]
["JAMES MADISON UNIVERSITY",871,null,null,null,null,null,null,null,null,null,null,null,null,null,null,null,null,null,null,null,null,null,null,null,70,1,"No",null,70,2,"No",null,70,3,"No",null,70,4,"No",null,null,null,null,null,70,6,"No",5083.62,70,97,null,null,null,null,null,null,70,9,"No"]
["KING AND QUEEN COUNTY PUBLIC SCHOOLS",49,null,null,null,null,null,null,null,null,null,null,null,null,null,null,null,null,null,null,null,null,null,null,null,71,1,"No",null,71,2,"No",null,71,3,"No",null,71,4,"No",null,null,null,null,null,71,6,"No",22706.829999999998,71,97,null,null,null,null,null,null,71,9,"No"]
["KING GEORGE COUNTY PUBLIC SCHOOLS",48,null,null,null,null,null,null,null,null,null,null,null,null,null,null,null,null,null,null,null,null,null,null,null,72,1,"No",null,72,2,"No",null,72,3,"No",null,72,4,"No",null,null,null,null,null,72,6,"No",2824.23,72,97,null,null,null,null,null,null,72,9,"No"]
["KING WILLIAM COUNTY PUBLIC SCHOOLS",50,null,null,null,null,null,null,null,null,null,null,null,null,null,null,null,null,null,null,null,null,null,null,null,73,1,"Yes",null,73,2,"Yes",null,73,3,"Yes",null,73,4,"Yes",null,null,null,null,null,73,6,"Yes",3953.9199999999996,73,97,null,null,null,null,null,null,73,9,"Yes"]
["LANCASTER COUNTY PUBLIC SCHOOLS",51,null,null,null,null,null,null,null,null,null,null,null,null,null,null,null,null,null,null,null,null,null,null,null,74,1,"Yes",null,74,2,"Yes",null,74,3,"Yes",null,74,4,"Yes",null,null,null,null,null,74,6,"Yes",9263.4800000000014,74,97,null,null,null,null,null,null,74,9,"Yes"]
["LEE COUNTY PUBLIC SCHOOLS",52,null,null,null,null,null,null,null,null,null,null,null,null,null,null,null,null,null,null,null,null,null,null,null,75,1,"No",null,75,2,"No",null,75,3,"No",null,75,4,"No",null,null,null,null,null,75,6,"No",1811932.4,75,97,null,null,null,null,null,null,75,9,"No"]
["LEXINGTON CITY PUBLIC SCHOOLS",137,null,null,null,null,null,null,null,null,null,null,null,null,null,null,null,null,null,null,null,null,null,null,null,77,1,"No",null,77,2,"No",null,77,3,"No",null,77,4,"No",null,null,null,null,null,77,6,"No",4744.71,77,97,null,null,null,null,null,null,77,9,"No"]
["LOUDOUN COUNTY PUBLIC SCHOOLS",53,null,null,null,null,null,null,null,null,null,null,null,null,null,null,null,null,null,null,null,null,null,null,null,78,1,"Yes",null,78,2,"Yes",null,78,3,"Yes",null,78,4,"Yes",null,null,null,null,null,78,6,"Yes",3502.05,78,97,null,null,null,null,null,null,78,9,"Yes"]
["LOUISA COUNTY PUBLIC SCHOOLS",54,null,null,null,null,null,null,null,null,null,null,null,null,null,null,null,null,null,null,null,null,null,null,null,79,1,"Yes",null,79,2,"Yes",null,79,3,"Yes",null,79,4,"Yes",null,null,null,null,null,79,6,"Yes",3953.9199999999996,79,97,null,null,null,null,null,null,79,9,"Yes"]
["LUNENBURG COUNTY PUBLIC SCHOOLS",55,null,null,null,null,null,null,null,null,null,null,null,null,null,null,null,null,null,null,null,null,null,null,null,80,1,"No",null,80,2,"No",null,80,3,"No",null,80,4,"No",null,null,null,null,null,80,6,"No",43243.37,80,97,null,null,null,null,null,null,80,9,"No"]
["LYNCHBURG CITY PUBLIC SCHOOLS",115,null,null,null,null,null,null,null,null,null,null,null,null,null,null,null,null,null,null,null,null,null,null,null,81,1,"Yes",null,81,2,"Yes",null,81,3,"Yes",null,81,4,"Yes",null,null,null,null,null,81,6,"Yes",3502.05,81,97,null,null,null,null,null,null,81,9,"Yes"]
["MADISON COUNTY PUBLIC SCHOOLS",56,null,null,null,null,null,null,null,null,null,null,null,null,null,null,null,null,null,null,null,null,null,null,null,82,1,"No",null,82,2,"No",null,82,3,"No",null,82,4,"No",null,null,null,null,null,82,6,"No",97266.58,82,97,null,null,null,null,null,null,82,9,"No"]
["MANASSAS CITY PUBLIC SCHOOLS",143,null,null,null,null,null,null,null,null,null,null,null,null,null,null,null,null,null,null,null,null,null,null,null,83,1,"No",null,83,2,"No",null,83,3,"No",null,83,4,"No",null,null,null,null,null,83,6,"No",1016.72,83,97,null,null,null,null,null,null,83,9,"No"]
["MANASSAS PARK CITY PUBLIC SCHOOLS",144,null,null,null,null,null,null,null,null,null,null,null,null,null,null,null,null,null,null,null,null,null,null,null,84,1,"No",null,84,2,"No",null,84,3,"No",null,84,4,"No",null,null,null,null,null,84,6,"No",677.82,84,97,null,null,null,null,null,null,84,9,"No"]
["MARTINSVILLE CITY PUBLIC SCHOOLS",116,null,null,null,null,null,null,null,null,null,null,null,null,null,null,null,null,null,null,null,null,null,null,null,85,1,"Yes",null,85,2,"Yes",null,85,3,"Yes",null,85,4,"Yes",null,null,null,null,null,85,6,"Yes",46227.01,85,97,null,null,null,null,null,null,85,9,"Yes"]
["MATHEWS COUNTY PUBLIC SCHOOLS",57,null,null,null,null,null,null,null,null,null,null,null,null,null,null,null,null,null,null,null,null,null,null,null,86,1,"No",null,86,2,"No",null,86,3,"No",null,86,4,"No",null,null,null,null,null,86,6,"No",3050.17,86,97,null,null,null,null,null,null,86,9,"No"]
["MCVH AUTHORITY",948,null,null,null,null,null,null,null,null,null,null,null,null,null,null,null,null,null,null,null,null,null,null,null,87,1,"No",null,87,2,"No",null,87,3,"No",null,87,4,"No",null,null,null,null,null,87,6,"No",677.82,87,97,null,null,null,null,null,null,87,9,"No"]
["MECKLENBURG COUNTY PUBLIC SCHOOLS",58,null,null,null,null,null,null,null,null,null,null,null,null,null,null,null,null,null,null,null,null,null,null,null,88,1,"No",null,88,2,"No",null,88,3,"No",null,88,4,"No",null,null,null,null,null,88,6,"No",146421.21,88,97,null,null,null,null,null,null,88,9,"No"]
["MIDDLESEX COUNTY PUBLIC SCHOOLS",59,null,null,null,null,null,null,null,null,null,null,null,null,null,null,null,null,null,null,null,null,null,null,null,89,1,"Yes",null,89,2,"Yes",null,89,3,"Yes",null,89,4,"Yes",null,null,null,null,null,89,6,"Yes",204947.44999999998,89,97,null,null,null,null,null,null,89,9,"Yes"]
["MONTGOMERY COUNTY PUBLIC SCHOOLS",60,null,null,null,null,null,null,null,null,null,null,null,null,null,null,null,null,null,null,null,null,null,null,null,90,1,"Yes",null,90,2,"Yes",null,90,3,"Yes",null,90,4,"Yes",null,null,null,null,null,90,6,"Yes",0,90,97,null,null,null,null,null,null,90,9,"Yes"]
["NELSON COUNTY PUBLIC SCHOOLS",62,null,null,null,null,null,null,null,null,null,null,null,null,null,null,null,null,null,null,null,null,null,null,null,91,1,"Yes",null,91,2,"Yes",null,91,3,"Yes",null,91,4,"Yes",null,null,null,null,null,91,6,"Yes",1129.69,91,97,null,null,null,null,null,null,91,9,"Yes"]
["NEW KENT COUNTY PUBLIC SCHOOLS",63,null,null,null,null,null,null,null,null,null,null,null,null,null,null,null,null,null,null,null,null,null,null,null,92,1,"No",null,92,2,"No",null,92,3,"No",null,92,4,"No",null,null,null,null,null,92,6,"No",1355.64,92,97,null,null,null,null,null,null,92,9,"No"]
["NEWPORT NEWS CITY PUBLIC SCHOOLS",117,null,null,null,null,null,null,null,null,null,null,null,null,null,null,null,null,null,null,null,null,null,null,null,93,1,"Yes",null,93,2,"Yes",null,93,3,"Yes",null,93,4,"Yes",null,null,null,null,null,93,6,"Yes",15250.86,93,97,null,null,null,null,null,null,93,9,"Yes"]
["NORFOLK CITY PUBLIC SCHOOLS",118,null,null,null,null,null,null,null,null,null,null,null,null,null,null,null,null,null,null,null,null,null,null,null,94,1,"Yes",null,94,2,"Yes",null,94,3,"Yes",null,94,4,"Yes",null,null,null,null,null,94,6,"Yes",0,94,97,null,null,null,null,null,null,94,9,"Yes"]
["NORTHAMPTON COUNTY PUBLIC SCHOOLS",65,null,null,null,null,null,null,null,null,null,null,null,null,null,null,null,null,null,null,null,null,null,null,null,95,1,"Yes",null,95,2,"Yes",null,95,3,"Yes",null,95,4,"Yes",null,null,null,null,null,95,6,"Yes",8924.58,95,97,null,null,null,null,null,null,95,9,"Yes"]
["NORTHUMBERLAND COUNTY PUBLIC SCHOOLS",66,null,null,null,null,null,null,null,null,null,null,null,null,null,null,null,null,null,null,null,null,null,null,null,96,1,"No",null,96,2,"No",null,96,3,"No",null,96,4,"No",null,null,null,null,null,96,6,"No",1468.6,96,97,null,null,null,null,null,null,96,9,"No"]
["NORTON CITY PUBLIC SCHOOLS",119,null,null,null,null,null,null,null,null,null,null,null,null,null,null,null,null,null,null,null,null,null,null,null,97,1,"Yes",null,97,2,"Yes",null,97,3,"Yes",null,97,4,"Yes",null,null,null,null,null,97,6,"Yes",0,97,97,null,null,null,null,null,null,97,9,"Yes"]
["NOTTOWAY COUNTY PUBLIC SCHOOLS",67,null,null,null,null,null,null,null,null,null,null,null,null,null,null,null,null,null,null,null,null,null,null,null,98,1,"Yes",null,98,2,"Yes",null,98,3,"Yes",null,98,4,"Yes",null,null,null,null,null,98,6,"Yes",42363.49,98,97,null,null,null,null,null,null,98,9,"Yes"]
["OLD DOMINION UNIVERSITY",798,null,null,null,null,null,null,null,null,null,null,null,null,null,null,null,null,null,null,null,null,null,null,null,101,1,"No",null,101,2,"No",null,101,3,"No",null,101,4,"No",null,null,null,null,null,101,6,"No",593779.87,101,97,null,null,null,null,null,null,101,9,"No"]
["ORANGE COUNTY PUBLIC SCHOOLS",68,null,null,null,null,null,null,null,null,null,null,null,null,null,null,null,null,null,null,null,null,null,null,null,102,1,"Yes",null,102,2,"Yes",null,102,3,"Yes",null,102,4,"Yes",null,null,null,null,null,102,6,"Yes",2259.39,102,97,null,null,null,null,null,null,102,9,"Yes"]
["PAGE COUNTY PUBLIC SCHOOLS",69,null,null,null,null,null,null,null,null,null,null,null,null,null,null,null,null,null,null,null,null,null,null,null,103,1,"No",null,103,2,"No",null,103,3,"No",null,103,4,"No",null,null,null,null,null,103,6,"No",225.94,103,97,null,null,null,null,null,null,103,9,"No"]
["PATRICK COUNTY PUBLIC SCHOOLS",70,null,null,null,null,null,null,null,null,null,null,null,null,null,null,null,null,null,null,null,null,null,null,null,104,1,"Yes",null,104,2,"Yes",null,104,3,"Yes",null,104,4,"Yes",null,null,null,null,null,104,6,"Yes",58191.939999999995,104,97,null,null,null,null,null,null,104,9,"Yes"]
["PETERSBURG CITY PUBLIC SCHOOLS",120,null,null,null,null,null,null,null,null,null,null,null,null,null,null,null,null,null,null,null,null,null,null,null,106,1,"Yes",null,106,2,"Yes",null,106,3,"Yes",null,106,4,"Yes",null,null,null,null,null,106,6,"Yes",9715.36,106,97,null,null,null,null,null,null,106,9,"Yes"]
["PITTSYLVANIA COUNTY PUBLIC SCHOOLS",71,null,null,null,null,null,null,null,null,null,null,null,null,null,null,null,null,null,null,null,null,null,null,null,107,1,"No",null,107,2,"No",null,107,3,"No",null,107,4,"No",null,null,null,null,null,107,6,"No",338.90000000000003,107,97,null,null,null,null,null,null,107,9,"No"]
["POQUOSON CITY PUBLIC SCHOOLS",142,null,null,null,null,null,null,null,null,null,null,null,null,null,null,null,null,null,null,null,null,null,null,null,108,1,"No",null,108,2,"No",null,108,3,"No",null,108,4,"No",null,null,null,null,null,108,6,"No",28100.7,108,97,null,null,null,null,null,null,108,9,"No"]
["PORTSMOUTH CITY PUBLIC SCHOOLS",121,null,null,null,null,null,null,null,null,null,null,null,null,null,null,null,null,null,null,null,null,null,null,null,109,1,"No",null,109,2,"No",null,109,3,"No",null,109,4,"No",null,null,null,null,null,109,6,"No",18188.060000000001,109,97,null,null,null,null,null,null,109,9,"No"]
["POWHATAN COUNTY PUBLIC SCHOOLS",72,null,null,null,null,null,null,null,null,null,null,null,null,null,null,null,null,null,null,null,null,null,null,null,110,1,"No",null,110,2,"No",null,110,3,"No",null,110,4,"No",null,null,null,null,null,110,6,"No",52756.67,110,97,null,null,null,null,null,null,110,9,"No"]
["PRINCE EDWARD COUNTY PUBLIC SCHOOLS",73,null,null,null,null,null,null,null,null,null,null,null,null,null,null,null,null,null,null,null,null,null,null,null,111,1,"No",null,111,2,"No",null,111,3,"No",null,111,4,"No",null,null,null,null,null,111,6,"No",19091.810000000001,111,97,null,null,null,null,null,null,111,9,"No"]
["PRINCE GEORGE COUNTY PUBLIC SCHOOLS",74,null,null,null,null,null,null,null,null,null,null,null,null,null,null,null,null,null,null,null,null,null,null,null,112,1,"No",null,112,2,"No",null,112,3,"No",null,112,4,"No",null,null,null,null,null,112,6,"No",36037.21,112,97,null,null,null,null,null,null,112,9,"No"]
["PRINCE WILLIAM COUNTY PUBLIC SCHOOLS",75,null,null,null,null,null,null,null,null,null,null,null,null,null,null,null,null,null,null,null,null,null,null,null,113,1,"No",null,113,2,"No",null,113,3,"No",null,113,4,"No",null,null,null,null,null,113,6,"No",242272.30000000002,113,97,null,null,null,null,null,null,113,9,"No"]
["PULASKI COUNTY PUBLIC SCHOOLS",77,null,null,null,null,null,null,null,null,null,null,null,null,null,null,null,null,null,null,null,null,null,null,null,114,1,"Yes",null,114,2,"Yes",null,114,3,"Yes",null,114,4,"Yes",null,null,null,null,null,114,6,"Yes",17058.370000000003,114,97,null,null,null,null,null,null,114,9,"Yes"]
["RADFORD CITY PUBLIC SCHOOLS",122,null,null,null,null,null,null,null,null,null,null,null,null,null,null,null,null,null,null,null,null,null,null,null,115,1,"Yes",null,115,2,"Yes",null,115,3,"Yes",null,115,4,"Yes",null,null,null,null,null,115,6,"Yes",24231.98,115,97,null,null,null,null,null,null,115,9,"Yes"]
["RAPPAHANNOCK COUNTY PUBLIC SCHOOLS",78,null,null,null,null,null,null,null,null,null,null,null,null,null,null,null,null,null,null,null,null,null,null,null,116,1,"Yes",null,116,2,"Yes",null,116,3,"Yes",null,116,4,"Yes",null,null,null,null,null,116,6,"Yes",12991.480000000001,116,97,null,null,null,null,null,null,116,9,"Yes"]
["RICHMOND CITY PUBLIC SCHOOLS",123,null,null,null,null,null,null,null,null,null,null,null,null,null,null,null,null,null,null,null,null,null,null,null,117,1,"No",null,117,2,"No",null,117,3,"No",null,117,4,"No",null,null,null,null,null,117,6,"No",189444.56,117,97,null,null,null,null,null,null,117,9,"No"]
["RICHMOND COUNTY PUBLIC SCHOOLS",79,null,null,null,null,null,null,null,null,null,null,null,null,null,null,null,null,null,null,null,null,null,null,null,118,1,"Yes",null,118,2,"Yes",null,118,3,"Yes",null,118,4,"Yes",null,null,null,null,null,118,6,"Yes",101848.12000000001,118,97,null,null,null,null,null,null,118,9,"Yes"]
["ROANOKE CITY PUBLIC SCHOOLS",124,null,null,null,null,null,null,null,null,null,null,null,null,null,null,null,null,null,null,null,null,null,null,null,119,1,"Yes",null,119,2,"Yes",null,119,3,"Yes",null,119,4,"Yes",null,null,null,null,null,119,6,"Yes",677.82,119,97,null,null,null,null,null,null,119,9,"Yes"]
["ROANOKE COUNTY PUBLIC SCHOOLS",80,null,null,null,null,null,null,null,null,null,null,null,null,null,null,null,null,null,null,null,null,null,null,null,120,1,"Yes",null,120,2,"Yes",null,120,3,"Yes",null,120,4,"Yes",null,null,null,null,null,120,6,"Yes",19430.73,120,97,null,null,null,null,null,null,120,9,"Yes"]
["ROCKBRIDGE COUNTY PUBLIC SCHOOLS",81,null,null,null,null,null,null,null,null,null,null,null,null,null,null,null,null,null,null,null,null,null,null,null,121,1,"Yes",null,121,2,"Yes",null,121,3,"Yes",null,121,4,"Yes",null,null,null,null,null,121,6,"Yes",12087.71,121,97,null,null,null,null,null,null,121,9,"Yes"]
["ROCKINGHAM COUNTY PUBLIC SCHOOLS",82,null,null,null,null,null,null,null,null,null,null,null,null,null,null,null,null,null,null,null,null,null,null,null,122,1,"No",null,122,2,"No",null,122,3,"No",null,122,4,"No",null,null,null,null,null,122,6,"No",1468.6,122,97,null,null,null,null,null,null,122,9,"No"]
["RUSSELL COUNTY PUBLIC SCHOOLS",83,null,null,null,null,null,null,null,null,null,null,null,null,null,null,null,null,null,null,null,null,null,null,null,123,1,"No",null,123,2,"No",null,123,3,"No",null,123,4,"No",null,null,null,null,null,123,6,"No",230570.37,123,97,null,null,null,null,null,null,123,9,"No"]
["SALEM CITY PUBLIC SCHOOLS",139,null,null,null,null,null,null,null,null,null,null,null,null,null,null,null,null,null,null,null,null,null,null,null,124,1,"Yes",null,124,2,"Yes",null,124,3,"Yes",null,124,4,"Yes",null,null,null,null,null,124,6,"Yes",135111.29999999999,124,97,null,null,null,null,null,null,124,9,"Yes"]
["SCOTT COUNTY PUBLIC SCHOOLS",84,null,null,null,null,null,null,null,null,null,null,null,null,null,null,null,null,null,null,null,null,null,null,null,126,1,"No",null,126,2,"No",null,126,3,"No",null,126,4,"No",null,null,null,null,null,126,6,"No",4405.7999999999993,126,97,null,null,null,null,null,null,126,9,"No"]
["SHENANDOAH COUNTY PUBLIC SCHOOLS",85,null,null,null,null,null,null,null,null,null,null,null,null,null,null,null,null,null,null,null,null,null,null,null,127,1,"Yes",null,127,2,"Yes",null,127,3,"Yes",null,127,4,"Yes",null,null,null,null,null,127,6,"Yes",7117.0700000000006,127,97,null,null,null,null,null,null,127,9,"Yes"]
["SMYTH COUNTY PUBLIC SCHOOLS",86,null,null,null,null,null,null,null,null,null,null,null,null,null,null,null,null,null,null,null,null,null,null,null,128,1,"No",null,128,2,"No",null,128,3,"No",null,128,4,"No",null,null,null,null,null,128,6,"No",142341.34,128,97,null,null,null,null,null,null,128,9,"No"]
["SOUTHAMPTON COUNTY PUBLIC SCHOOLS",87,null,null,null,null,null,null,null,null,null,null,null,null,null,null,null,null,null,null,null,null,null,null,null,130,1,"Yes",null,130,2,"Yes",null,130,3,"Yes",null,130,4,"Yes",null,null,null,null,null,130,6,"Yes",14121.17,130,97,null,null,null,null,null,null,130,9,"Yes"]
["SOUTHWESTERN VA TRAINING CENTER",951,null,null,null,null,null,null,null,null,null,null,null,null,null,null,null,null,null,null,null,null,null,null,null,131,1,"Yes",null,131,2,"Yes",null,131,3,"Yes",null,131,4,"Yes",null,null,null,null,null,131,6,"Yes",61003.43,131,97,null,null,null,null,null,null,131,9,"Yes"]
["SPOTSYLVANIA COUNTY PUBLIC SCHOOLS",88,null,null,null,null,null,null,null,null,null,null,null,null,null,null,null,null,null,null,null,null,null,null,null,132,1,"Yes",null,132,2,"Yes",null,132,3,"Yes",null,132,4,"Yes",null,null,null,null,null,132,6,"Yes",98207.25,132,97,null,null,null,null,null,null,132,9,"Yes"]
["STAFFORD COUNTY PUBLIC SCHOOLS",89,null,null,null,null,null,null,null,null,null,null,null,null,null,null,null,null,null,null,null,null,null,null,null,134,null,null,null,134,2,null,null,134,3,null,null,134,4,null,null,null,null,null,null,134,6,null,null,134,97,null,null,null,null,null,null,134,9]
["STAUNTON CITY PUBLIC SCHOOLS",126,null,null,null,null,null,null,null,null,null,null,null,null,null,null,null,null,null,null,null,null,null,null,null,135,1,"Yes",null,135,2,"Yes",null,135,3,"Yes",null,135,4,"Yes",null,null,null,null,null,135,6,"Yes",1468.6,135,97,null,null,null,null,null,null,135,9,"Yes"]
["SUFFOLK CITY PUBLIC SCHOOLS",127,null,null,null,null,null,null,null,null,null,null,null,null,null,null,null,null,null,null,null,null,null,null,null,136,1,"No",null,136,2,"No",null,136,3,"No",null,136,4,"No",null,null,null,null,null,136,6,"No",89050.99,136,97,null,null,null,null,null,null,136,9,"No"]
["SURRY COUNTY PUBLIC SCHOOLS",90,null,null,null,null,null,null,null,null,null,null,null,null,null,null,null,null,null,null,null,null,null,null,null,137,1,"No",null,137,2,"No",null,137,3,"No",null,137,4,"No",null,null,null,null,null,137,6,"No",2259.39,137,97,null,null,null,null,null,null,137,9,"No"]
["SUSSEX COUNTY PUBLIC SCHOOLS",91,null,null,null,null,null,null,null,null,null,null,null,null,null,null,null,null,null,null,null,null,null,null,null,138,null,null,null,138,2,null,null,138,3,null,null,138,4,null,null,null,null,null,null,138,6,null,null,138,97,null,null,null,null,null,null,138,9]
["TAZEWELL COUNTY PUBLIC SCHOOLS",92,null,null,null,null,null,null,null,null,null,null,null,null,null,null,null,null,null,null,null,null,null,null,null,139,1,"Yes",null,139,2,"Yes",null,139,3,"Yes",null,139,4,"Yes",null,null,null,null,null,139,6,"Yes",17552.66,139,97,null,null,null,null,null,null,139,9,"Yes"]
["VA BEACH CITY PUBLIC SCHOOLS",128,null,null,null,null,null,null,null,null,null,null,null,null,null,null,null,null,null,null,null,null,null,null,null,140,1,null,null,140,2,null,null,140,3,null,null,140,4,null,null,null,null,null,null,140,6,null,null,140,97,null,null,null,null,null,null,140,9]
["VA DEPT OF CORRECTIONAL EDUCATION",900,null,null,null,null,null,null,null,null,null,null,null,null,null,null,null,null,null,null,null,null,null,null,null,142,null,"Yes",null,142,2,"Yes",null,142,3,"Yes",null,142,4,"Yes",null,null,null,null,null,142,6,"Yes",0,142,97,null,null,null,null,null,null,142,9,"Yes"]
["VIRGINIA COMMONWEALTH UNIVERSITY",881,null,null,null,null,null,null,null,null,null,null,null,null,null,null,null,null,null,null,null,null,null,null,null,143,1,"Yes",null,143,2,"Yes",null,143,3,"Yes",null,143,4,"Yes",null,null,null,null,null,143,6,"Yes",269883.69,143,97,null,null,null,null,null,null,143,9,"Yes"]
["VSDB STAUNTON",218,null,null,null,null,null,null,null,null,null,null,null,null,null,null,null,null,null,null,null,null,null,null,null,144,1,"Yes",null,144,2,"Yes",null,144,3,"Yes",null,144,4,"Yes",null,null,null,null,null,144,6,"Yes",138726.32,144,97,null,null,null,null,null,null,144,9,"Yes"]
["WARREN COUNTY PUBLIC SCHOOLS",93,null,null,null,null,null,null,null,null,null,null,null,null,null,null,null,null,null,null,null,null,null,null,null,202,1,"Yes",null,202,2,"Yes",null,202,3,"Yes",null,202,4,"Yes",null,null,null,null,null,202,6,"Yes",677.82,202,97,null,null,null,null,null,null,202,9,"Yes"]
["WASHINGTON COUNTY PUBLIC SCHOOLS",94,null,null,null,null,null,null,null,null,null,null,null,null,null,null,null,null,null,null,null,null,null,null,null,207,1,"Yes",null,207,2,"Yes",null,207,3,"Yes",null,207,4,"Yes",null,null,null,null,null,207,6,"Yes",451.88,207,97,null,null,null,null,null,null,207,9,"Yes"]
["WAYNESBORO CITY PUBLIC SCHOOLS",130,null,null,null,null,null,null,null,null,null,null,null,null,null,null,null,null,null,null,null,null,null,null,null,218,1,"No",null,218,2,"No",null,218,3,"No",null,218,4,"No",null,null,null,null,null,218,6,"No",null,218,97,null,null,null,null,null,null,218,9,"No"]
["WEST POINT TOWN PUBLIC SCHOOLS",207,null,null,null,null,null,null,null,null,null,null,null,null,null,null,null,null,null,null,null,null,null,null,null,219,null,null,null,219,2,null,null,219,3,null,null,219,4,null,null,null,null,null,null,871,6,null,null,219,97,null,null,null,null,null,null,219,9]
["WESTMORELAND COUNTY PUBLIC SCHOOLS",95,null,null,null,null,null,null,null,null,null,null,null,null,null,null,null,null,null,null,null,null,null,null,null,871,null,null,null,871,2,null,null,871,3,null,null,871,4,null,null,null,null,null,null,881,6,null,null,871,97,null,null,null,null,null,null,871,9]
["WILLIAMSBURG CITY PUBLIC SCHOOLS",131,null,null,null,null,null,null,null,null,null,null,null,null,null,null,null,null,null,null,null,null,null,null,null,917,null,null,null,917,2,null,null,917,3,null,null,917,4,null,null,null,null,null,null,917,6,null,790.79000000000008,917,97,null,null,null,null,null,null,900,9]
["WINCHESTER CITY PUBLIC SCHOOLS",132]
["WISE COUNTY PUBLIC SCHOOLS",96,null,null,null,null,null,null,null,null,null,null,null,null,null,null,null,null,null,null,null,null,null,null,null,null,null,null,null,null,null,null,null,null,null,null,null,null,null,null,null,null,null,null,null,null,null,null,{"$f":"SUM(AW3:AW143)","v":12765696.000000007},null,null,null,0]
["WOODROW WILSON REHABILITATION CTR",947]
["WYTHE COUNTY PUBLIC SCHOOLS",97,null,null,null,null,null,null,null,null,null,null,null,null,null,null,null,null,null,null,null,null,null,null,null,null,null,null,null,null,null,null,null,null,null,null,null,null,null,null,null,null,null,null,null,null,null,null,{"$f":"AW144-12765696","v":0}]
["YORK COUNTY PUBLIC SCHOOLS",98,null,null,null,null,null,null,null,null,null,null,null,null,null,null,null,null,null,null,null,null,null,null,null,null,null,null,null,null,null,null,null,null,null,null,null,null,null,null,null,null,null,null,null,null,null,null,null,null,null,null,null,null,null,null,null,null,null,null,0]
["YORK COUNTY PUBLIC SCHOOLS",98]
[null,null,null,null,null,null,null,null,null,null,null,null,null,null,null,null,null,null,null,null,null,null,null,null,1]
[null,null,null,null,null,null,null,null,null,null,null,null,null,null,null,null,null,null,null,null,null,null,null,null,2]
[null,null,null,null,null,null,null,null,null,null,null,null,null,null,null,null,null,null,null,null,null,null,null,null,3]
[null,null,null,null,null,null,null,null,null,null,null,null,null,null,null,null,null,null,null,null,null,null,null,null,4]
[null,null,null,null,null,null,null,null,null,null,null,null,null,null,null,null,null,null,null,null,null,null,null,null,5]
[null,null,null,null,null,null,null,null,null,null,null,null,null,null,null,null,null,null,null,null,null,null,null,null,6]
[null,null,null,null,null,null,null,null,null,null,null,null,null,null,null,null,null,null,null,null,null,null,null,null,7]
[null,null,null,null,null,null,null,null,null,null,null,null,null,null,null,null,null,null,null,null,null,null,null,null,8]
[null,null,null,null,null,null,null,null,null,null,null,null,null,null,null,null,null,null,null,null,null,null,null,null,9]
[null,null,null,null,null,null,null,null,null,null,null,null,null,null,null,null,null,null,null,null,null,null,null,null,10]
[null,null,null,null,null,null,null,null,null,null,null,null,null,null,null,null,null,null,null,null,null,null,null,null,11]
[null,null,null,null,null,null,null,null,null,null,null,null,null,null,null,null,null,null,null,null,null,null,null,null,12]
[null,null,null,null,null,null,null,null,null,null,null,null,null,null,null,null,null,null,null,null,null,null,null,null,13]
[null,null,null,null,null,null,null,null,null,null,null,null,null,null,null,null,null,null,null,null,null,null,null,null,14]
[null,null,null,null,null,null,null,null,null,null,null,null,null,null,null,null,null,null,null,null,null,null,null,null,15]
[null,null,null,null,null,null,null,null,null,null,null,null,null,null,null,null,null,null,null,null,null,null,null,null,16]
[null,null,null,null,null,null,null,null,null,null,null,null,null,null,null,null,null,null,null,null,null,null,null,null,17]
[null,null,null,null,null,null,null,null,null,null,null,null,null,null,null,null,null,null,null,null,null,null,null,null,18]
[null,null,null,null,null,null,null,null,null,null,null,null,null,null,null,null,null,null,null,null,null,null,null,null,19]
[null,null,null,null,null,null,null,null,null,null,null,null,null,null,null,null,null,null,null,null,null,null,null,null,20]
[null,null,null,null,null,null,null,null,null,null,null,null,null,null,null,null,null,null,null,null,null,null,null,null,21]
[null,null,null,null,null,null,null,null,null,null,null,null,null,null,null,null,null,null,null,null,null,null,null,null,22]
[null,null,null,null,null,null,null,null,null,null,null,null,null,null,null,null,null,null,null,null,null,null,null,null,23]
[null,null,null,null,null,null,null,null,null,null,null,null,null,null,null,null,null,null,null,null,null,null,null,null,24]
[null,null,null,null,null,null,null,null,null,null,null,null,null,null,null,null,null,null,null,null,null,null,null,null,25]
[null,null,null,null,null,null,null,null,null,null,null,null,null,null,null,null,null,null,null,null,null,null,null,null,26]
[null,null,null,null,null,null,null,null,null,null,null,null,null,null,null,null,null,null,null,null,null,null,null,null,27]
[null,null,null,null,null,null,null,null,null,null,null,null,null,null,null,null,null,null,null,null,null,null,null,null,28]
[null,null,null,null,null,null,null,null,null,null,null,null,null,null,null,null,null,null,null,null,null,null,null,null,29]
[null,null,null,null,null,null,null,null,null,null,null,null,null,null,null,null,null,null,null,null,null,null,null,null,30]
[null,null,null,null,null,null,null,null,null,null,null,null,null,null,null,null,null,null,null,null,null,null,null,null,31]
[null,null,null,null,null,null,null,null,null,null,null,null,null,null,null,null,null,null,null,null,null,null,null,null,32]
[null,null,null,null,null,null,null,null,null,null,null,null,null,null,null,null,null,null,null,null,null,null,null,null,33]
[null,null,null,null,null,null,null,null,null,null,null,null,null,null,null,null,null,null,null,null,null,null,null,null,34]
[null,null,null,null,null,null,null,null,null,null,null,null,null,null,null,null,null,null,null,null,null,null,null,null,35]
[null,null,null,null,null,null,null,null,null,null,null,null,null,null,null,null,null,null,null,null,null,null,null,null,36]
[null,null,null,null,null,null,null,null,null,null,null,null,null,null,null,null,null,null,null,null,null,null,null,null,37]
[null,null,null,null,null,null,null,null,null,null,null,null,null,null,null,null,null,null,null,null,null,null,null,null,38]
[null,null,null,null,null,null,null,null,null,null,null,null,null,null,null,null,null,null,null,null,null,null,null,null,39]
[null,null,null,null,null,null,null,null,null,null,null,null,null,null,null,null,null,null,null,null,null,null,null,null,40]
[null,null,null,null,null,null,null,null,null,null,null,null,null,null,null,null,null,null,null,null,null,null,null,null,41]
[null,null,null,null,null,null,null,null,null,null,null,null,null,null,null,null,null,null,null,null,null,null,null,null,42]
[null,null,null,null,null,null,null,null,null,null,null,null,null,null,null,null,null,null,null,null,null,null,null,null,43]
[null,null,null,null,null,null,null,null,null,null,null,null,null,null,null,null,null,null,null,null,null,null,null,null,44]
[null,null,null,null,null,null,null,null,null,null,null,null,null,null,null,null,null,null,null,null,null,null,null,null,45]
[null,null,null,null,null,null,null,null,null,null,null,null,null,null,null,null,null,null,null,null,null,null,null,null,46]
[null,null,null,null,null,null,null,null,null,null,null,null,null,null,null,null,null,null,null,null,null,null,null,null,47]
[null,null,null,null,null,null,null,null,null,null,null,null,null,null,null,null,null,null,null,null,null,null,null,null,48]
[null,null,null,null,null,null,null,null,null,null,null,null,null,null,null,null,null,null,null,null,null,null,null,null,49]
[null,null,null,null,null,null,null,null,null,null,null,null,null,null,null,null,null,null,null,null,null,null,null,null,50]
[null,null,null,null,null,null,null,null,null,null,null,null,null,null,null,null,null,null,null,null,null,null,null,null,51]
[null,null,null,null,null,null,null,null,null,null,null,null,null,null,null,null,null,null,null,null,null,null,null,null,52]
[null,null,null,null,null,null,null,null,null,null,null,null,null,null,null,null,null,null,null,null,null,null,null,null,53]
[null,null,null,null,null,null,null,null,null,null,null,null,null,null,null,null,null,null,null,null,null,null,null,null,54]
[null,null,null,null,null,null,null,null,null,null,null,null,null,null,null,null,null,null,null,null,null,null,null,null,55]
[null,null,null,null,null,null,null,null,null,null,null,null,null,null,null,null,null,null,null,null,null,null,null,null,56]
[null,null,null,null,null,null,null,null,null,null,null,null,null,null,null,null,null,null,null,null,null,null,null,null,57]
[null,null,null,null,null,null,null,null,null,null,null,null,null,null,null,null,null,null,null,null,null,null,null,null,58]
[null,null,null,null,null,null,null,null,null,null,null,null,null,null,null,null,null,null,null,null,null,null,null,null,59]
[null,null,null,null,null,null,null,null,null,null,null,null,null,null,null,null,null,null,null,null,null,null,null,null,60]
[null,null,null,null,null,null,null,null,null,null,null,null,null,null,null,null,null,null,null,null,null,null,null,null,62]
[null,null,null,null,null,null,null,null,null,null,null,null,null,null,null,null,null,null,null,null,null,null,null,null,63]
[null,null,null,null,null,null,null,null,null,null,null,null,null,null,null,null,null,null,null,null,null,null,null,null,65]
[null,null,null,null,null,null,null,null,null,null,null,null,null,null,null,null,null,null,null,null,null,null,null,null,66]
[null,null,null,null,null,null,null,null,null,null,null,null,null,null,null,null,null,null,null,null,null,null,null,null,67]
[null,null,null,null,null,null,null,null,null,null,null,null,null,null,null,null,null,null,null,null,null,null,null,null,68]
[null,null,null,null,null,null,null,null,null,null,null,null,null,null,null,null,null,null,null,null,null,null,null,null,69]
[null,null,null,null,null,null,null,null,null,null,null,null,null,null,null,null,null,null,null,null,null,null,null,null,70]
[null,null,null,null,null,null,null,null,null,null,null,null,null,null,null,null,null,null,null,null,null,null,null,null,71]
[null,null,null,null,null,null,null,null,null,null,null,null,null,null,null,null,null,null,null,null,null,null,null,null,72]
[null,null,null,null,null,null,null,null,null,null,null,null,null,null,null,null,null,null,null,null,null,null,null,null,73]
[null,null,null,null,null,null,null,null,null,null,null,null,null,null,null,null,null,null,null,null,null,null,null,null,74]
[null,null,null,null,null,null,null,null,null,null,null,null,null,null,null,null,null,null,null,null,null,null,null,null,75]
[null,null,null,null,null,null,null,null,null,null,null,null,null,null,null,null,null,null,null,null,null,null,null,null,77]
[null,null,null,null,null,null,null,null,null,null,null,null,null,null,null,null,null,null,null,null,null,null,null,null,78]
[null,null,null,null,null,null,null,null,null,null,null,null,null,null,null,null,null,null,null,null,null,null,null,null,79]
[null,null,null,null,null,null,null,null,null,null,null,null,null,null,null,null,null,null,null,null,null,null,null,null,80]
[null,null,null,null,null,null,null,null,null,null,null,null,null,null,null,null,null,null,null,null,null,null,null,null,81]
[null,null,null,null,null,null,null,null,null,null,null,null,null,null,null,null,null,null,null,null,null,null,null,null,82]
[null,null,null,null,null,null,null,null,null,null,null,null,null,null,null,null,null,null,null,null,null,null,null,null,83]
[null,null,null,null,null,null,null,null,null,null,null,null,null,null,null,null,null,null,null,null,null,null,null,null,84]
[null,null,null,null,null,null,null,null,null,null,null,null,null,null,null,null,null,null,null,null,null,null,null,null,85]
[null,null,null,null,null,null,null,null,null,null,null,null,null,null,null,null,null,null,null,null,null,null,null,null,86]
[null,null,null,null,null,null,null,null,null,null,null,null,null,null,null,null,null,null,null,null,null,null,null,null,87]
[null,null,null,null,null,null,null,null,null,null,null,null,null,null,null,null,null,null,null,null,null,null,null,null,88]
[null,null,null,null,null,null,null,null,null,null,null,null,null,null,null,null,null,null,null,null,null,null,null,null,89]
[null,null,null,null,null,null,null,null,null,null,null,null,null,null,null,null,null,null,null,null,null,null,null,null,90]
[null,null,null,null,null,null,null,null,null,null,null,null,null,null,null,null,null,null,null,null,null,null,null,null,91]
[null,null,null,null,null,null,null,null,null,null,null,null,null,null,null,null,null,null,null,null,null,null,null,null,92]
[null,null,null,null,null,null,null,null,null,null,null,null,null,null,null,null,null,null,null,null,null,null,null,null,93]
[null,null,null,null,null,null,null,null,null,null,null,null,null,null,null,null,null,null,null,null,null,null,null,null,94]
[null,null,null,null,null,null,null,null,null,null,null,null,null,null,null,null,null,null,null,null,null,null,null,null,95]
[null,null,null,null,null,null,null,null,null,null,null,null,null,null,null,null,null,null,null,null,null,null,null,null,96]
[null,null,null,null,null,null,null,null,null,null,null,null,null,null,null,null,null,null,null,null,null,null,null,null,97]
[null,null,null,null,null,null,null,null,null,null,null,null,null,null,null,null,null,null,null,null,null,null,null,null,98]
[null,null,null,null,null,null,null,null,null,null,null,null,null,null,null,null,null,null,null,null,null,null,null,null,101]
[null,null,null,null,null,null,null,null,null,null,null,null,null,null,null,null,null,null,null,null,null,null,null,null,102]
[null,null,null,null,null,null,null,null,null,null,null,null,null,null,null,null,null,null,null,null,null,null,null,null,103]
[null,null,null,null,null,null,null,null,null,null,null,null,null,null,null,null,null,null,null,null,null,null,null,null,104]
[null,null,null,null,null,null,null,null,null,null,null,null,null,null,null,null,null,null,null,null,null,null,null,null,106]
[null,null,null,null,null,null,null,null,null,null,null,null,null,null,null,null,null,null,null,null,null,null,null,null,107]
[null,null,null,null,null,null,null,null,null,null,null,null,null,null,null,null,null,null,null,null,null,null,null,null,108]
[null,null,null,null,null,null,null,null,null,null,null,null,null,null,null,null,null,null,null,null,null,null,null,null,109]
[null,null,null,null,null,null,null,null,null,null,null,null,null,null,null,null,null,null,null,null,null,null,null,null,110]
[null,null,null,null,null,null,null,null,null,null,null,null,null,null,null,null,null,null,null,null,null,null,null,null,111]
[null,null,null,null,null,null,null,null,null,null,null,null,null,null,null,null,null,null,null,null,null,null,null,null,112]
[null,null,null,null,null,null,null,null,null,null,null,null,null,null,null,null,null,null,null,null,null,null,null,null,113]
[null,null,null,null,null,null,null,null,null,null,null,null,null,null,null,null,null,null,null,null,null,null,null,null,114]
[null,null,null,null,null,null,null,null,null,null,null,null,null,null,null,null,null,null,null,null,null,null,null,null,115]
[null,null,null,null,null,null,null,null,null,null,null,null,null,null,null,null,null,null,null,null,null,null,null,null,116]
[null,null,null,null,null,null,null,null,null,null,null,null,null,null,null,null,null,null,null,null,null,null,null,null,117]
[null,null,null,null,null,null,null,null,null,null,null,null,null,null,null,null,null,null,null,null,null,null,null,null,118]
[null,null,null,null,null,null,null,null,null,null,null,null,null,null,null,null,null,null,null,null,null,null,null,null,119]
[null,null,null,null,null,null,null,null,null,null,null,null,null,null,null,null,null,null,null,null,null,null,null,null,120]
[null,null,null,null,null,null,null,null,null,null,null,null,null,null,null,null,null,null,null,null,null,null,null,null,121]
[null,null,null,null,null,null,null,null,null,null,null,null,null,null,null,null,null,null,null,null,null,null,null,null,122]
[null,null,null,null,null,null,null,null,null,null,null,null,null,null,null,null,null,null,null,null,null,null,null,null,123]
[null,null,null,null,null,null,null,null,null,null,null,null,null,null,null,null,null,null,null,null,null,null,null,null,124]
[null,null,null,null,null,null,null,null,null,null,null,null,null,null,null,null,null,null,null,null,null,null,null,null,126]
[null,null,null,null,null,null,null,null,null,null,null,null,null,null,null,null,null,null,null,null,null,null,null,null,127]
[null,null,null,null,null,null,null,null,null,null,null,null,null,null,null,null,null,null,null,null,null,null,null,null,128]
[null,null,null,null,null,null,null,null,null,null,null,null,null,null,null,null,null,null,null,null,null,null,null,null,130]
[null,null,null,null,null,null,null,null,null,null,null,null,null,null,null,null,null,null,null,null,null,null,null,null,131]
[null,null,null,null,null,null,null,null,null,null,null,null,null,null,null,null,null,null,null,null,null,null,null,null,132]
[null,null,null,null,null,null,null,null,null,null,null,null,null,null,null,null,null,null,null,null,null,null,null,null,134]
[null,null,null,null,null,null,null,null,null,null,null,null,null,null,null,null,null,null,null,null,null,null,null,null,135]
[null,null,null,null,null,null,null,null,null,null,null,null,null,null,null,null,null,null,null,null,null,null,null,null,136]
[null,null,null,null,null,null,null,null,null,null,null,null,null,null,null,null,null,null,null,null,null,null,null,null,137]
[null,null,null,null,null,null,null,null,null,null,null,null,null,null,null,null,null,null,null,null,null,null,null,null,138]
[null,null,null,null,null,null,null,null,null,null,null,null,null,null,null,null,null,null,null,null,null,null,null,null,139]
[null,null,null,null,null,null,null,null,null,null,null,null,null,null,null,null,null,null,null,null,null,null,null,null,140]
[null,null,null,null,null,null,null,null,null,null,null,null,null,null,null,null,null,null,null,null,null,null,null,null,142]
[null,null,null,null,null,null,null,null,null,null,null,null,null,null,null,null,null,null,null,null,null,null,null,null,143]
[null,null,null,null,null,null,null,null,null,null,null,null,null,null,null,null,null,null,null,null,null,null,null,null,144]
[null,null,null,null,null,null,null,null,null,null,null,null,null,null,null,null,null,null,null,null,null,null,null,null,202]
[null,null,null,null,null,null,null,null,null,null,null,null,null,null,null,null,null,null,null,null,null,null,null,null,207]
[null,null,null,null,null,null,null,null,null,null,null,null,null,null,null,null,null,null,null,null,null,null,null,null,218]
[null,null,null,null,null,null,null,null,null,null,null,null,null,null,null,null,null,null,null,null,null,null,null,null,219]
[null,null,null,null,null,null,null,null,null,null,null,null,null,null,null,null,null,null,null,null,null,null,null,null,871]
[null,null,null,null,null,null,null,null,null,null,null,null,null,null,null,null,null,null,null,null,null,null,null,null,917]

{"sheet":"Sheet2","index":9,"n_rows":2,"n_cols":5,"rows_kept":2,"cut":false,"hidden":true,"merged":[]}
["EL Subgrant",null,"Title II, Part A, Transferability",null,"Yes"]
["IY Subgrant",null,"Title IV, Part A, Transferability",null,"No"]